program: Gaussian 09
title: 000211637
version: EM64L-G09RevD.01
frameworkgroup: C1[X(C9H15NO3S2)]
method: RPBEPBE
basis: SDD
operation: Freq
keyword: #p
keyword: freq=noraman
keyword: PBEPBE/SDD
title: #p freq=noraman PBEPBE/SDD
converged: YES YES NO NO
title: Mulliken charges:
elementType: S S O O O N C C C C C C C C C H H H H H H H H H H H H H H H
charge: 0.270906 0.049942 -0.404662 -0.253054 -0.250177 -0.023622 0.339487 -0.606363 -0.339450 -0.719662 -0.536541 -0.314418 -0.616578 0.297639 -0.757610 0.310865 0.236467 0.253152 0.252418 0.248052 0.222907 0.243896 0.233631 0.254058 0.261701 0.240937 0.352410 0.250192 0.255742 0.247734
chargesum: 0.00000
title: Mulliken charges with hydrogens summed into heavy atoms:
elementType: S S O O O N C C C C C C C C C
charge: 0.270906 0.049942 -0.052252 -0.253054 -0.250177 -0.023622 0.339487 -0.295498 0.150169 0.003715 -0.536541 0.163109 0.140119 0.297639 -0.003941
polarizability: 2.06188889e+02 1.97955807e+01 1.45403068e+02 4.45888264e+00 -5.40043606e+00 9.87317938e+01
1716.lowfreq: -32.5510 -7.8969 -0.0018 0.0007 0.0008 5.9353 12.4801 26.5347 35.8547
frequency: -32.5083 26.4031 35.8317 55.8459 70.2616 78.4064 93.9592 133.0055 159.1966 179.7578 206.5414 224.0646 248.9882 258.5226 283.1428 312.2191 331.7910 343.7752 367.1489 397.6827 430.8768 461.0391 483.7769 502.9355 537.7475 556.5065 581.8706 623.3409 640.2617 659.0605 761.6571 780.7199 819.3615 840.9144 900.6374 935.9045 963.1131 1003.2719 1035.8169 1048.1582 1051.8938 1059.9501 1092.2997 1103.9841 1115.5171 1120.6213 1166.4742 1192.1626 1194.9133 1215.5466 1235.4369 1272.5892 1293.3112 1317.1388 1353.6935 1364.4825 1378.7950 1386.2677 1393.6164 1434.1954 1446.4484 1455.4161 1457.8235 1458.0781 1460.3922 1473.5602 1484.0572 1486.7342 1644.7872 2987.0283 3008.8347 3009.0879 3013.0666 3020.4061 3033.3415 3073.7526 3083.0459 3096.6322 3101.5746 3104.9699 3115.3148 3119.5064 3141.2122 3502.8903
redmass: 1.0898 5.6698 5.9931 4.2018 3.8855 6.1824 4.4406 3.3879 1.0895 2.5731 1.2231 5.0056 5.1488 3.2355 3.2209 3.6964 2.8897 3.9454 7.9936 3.4066 2.7260 1.5107 6.2230 4.4113 4.1245 6.9204 3.3887 4.4021 4.0448 3.1102 2.9906 3.0831 1.9318 3.1902 3.7628 3.1884 3.5843 2.0000 1.9431 1.6537 2.3812 1.9353 2.5241 2.0018 2.7085 1.3518 2.5320 1.6622 2.6982 3.4005 1.2643 1.2513 1.0993 1.5069 2.0484 2.2713 1.3186 1.2530 1.2818 1.2703 1.0841 1.0696 1.0495 1.0628 1.0870 1.0949 1.0549 1.0535 9.7196 1.0326 1.0590 1.0375 1.0367 1.0593 1.0853 1.0998 1.1025 1.0971 1.1010 1.1071 1.0998 1.1003 1.1012 1.0653
irintensity: 1.8224 0.9951 2.5896 2.4203 1.1945 2.3975 0.2840 1.7636 0.5841 2.3720 0.5893 1.4003 1.8235 1.3833 12.1272 11.6031 0.9294 6.0918 0.7495 43.2838 10.7033 70.2912 49.0754 8.4568 5.1465 15.9959 3.7643 8.3491 1.7638 4.6334 15.8369 18.8805 4.3017 86.7454 54.9976 72.7638 23.4830 66.3198 17.3308 21.0858 15.5196 51.2470 2.3209 161.0472 41.5587 13.6650 13.3676 263.2769 220.1261 93.2206 21.8788 14.3099 3.1840 26.6274 74.6633 98.2517 5.3329 52.1468 21.3325 49.9883 1.2094 11.9498 11.3142 15.5580 10.2668 58.9042 21.1622 8.0082 164.3650 43.0041 0.8687 2.2205 7.3301 31.4330 6.7311 4.1557 18.4329 6.0513 2.9459 15.7187 14.8141 11.8182 7.8577 5.6738
temp: 298.150 k
press: 1.00000 atm
elementType: 16 16 8 8 8 7 6 6 6 6 6 6 6 6 6 1 1 1 1 1 1 1 1 1 1 1 1 1 1 1
symmnumber: 1
zpe: 615445.0 jmol-1
zpe.correction: 0.234411 hartree
zpe.thermalcorrener: 0.251206 hartree
zpe.thermalcorrenthalpy: 0.252150 hartree
zpe.thermalcorrgfe: 0.188367 hartree
zpe.sumelectzpe: -1427.336221 hartree
zpe.sumelectthermal: -1427.319426 hartree
zpe.sumelectthermalent: -1427.318481 hartree
zpe.sumelectthermalfe: -1427.382264 hartree
dipole: 2.8534 2.7409 0.5969
dipole: 4.0013
quadrupole: -107.3002 -108.2701 -106.4631
quadrupole: -16.2835 5.7879 -1.5744
quadrupole: 0.0443 -0.9256 0.8814 -16.2835 5.7879 -1.5744
hfenergy: -1427.5706312 hartree
pointgroup: C01 [X(C9H15N1O3S2)]
dipole: 0.9501525 1.2550103 0.0203119 debye
polarizability: 199.0312435|28.4894182|149.1332129|1.2950523|-13.5716473|102.1592945 unknown
InChI: InChI=1S/C9H15NO3S2/c1-6(11)13-5-4-7-9(2,12)10(3)8(14)15-7/h7,12H,4-5H2,1-3H3
charge 0 multiplicity 1
30 atoms
S  -1.217379 -1.78117 0.36004
S  -4.281582 -2.183773 0.216092
O  -1.532903 1.44566 1.326682
O  3.245861 -0.49634 0.501665
O  3.622153 0.934516 -1.30286
N  -2.909047 0.183983 -0.216771
C  -1.610834 0.908282 -0.040621
C  -0.49965 -0.145084 -0.32445
C  0.868338 0.190295 0.281298
C  -1.491739 2.129716 -0.95695
C  -2.936372 -1.166896 0.079671
C  1.927228 -0.860826 -0.088867
C  -4.150669 0.967884 -0.352609
C  4.009659 0.430969 -0.223163
C  5.323083 0.709996 0.471823
H  -0.421066 -0.283019 -1.417803
H  0.795122 0.279704 1.379144
H  1.196171 1.17144 -0.110142
H  -2.228972 2.896552 -0.670409
H  -0.489409 2.574271 -0.849297
H  -1.646445 1.847638 -2.011722
H  1.704268 -1.847154 0.349724
H  2.036453 -0.945023 -1.185782
H  -4.190785 1.745492 0.431017
H  -5.002524 0.279399 -0.232119
H  -4.205371 1.442218 -1.347555
H  -1.553923 0.682278 1.964756
H  6.155998 0.459882 -0.207996
H  5.415234 0.12998 1.400809
H  5.398007 1.788332 0.695696
