program: Gaussian 09
title: 000211632
version: EM64L-G09RevD.01
frameworkgroup: C1[X(C17H36N)]
method: RPBEPBE
basis: SDD
operation: Freq
keyword: #p
keyword: freq=noraman
keyword: PBEPBE/SDD
title: #p freq=noraman PBEPBE/SDD
converged: NO YES NO NO
title: Mulliken charges:
elementType: N C C C C C C C C C C C C C C C C C H H H H H H H H H H H H H H H H H H H H H H H H H H H H H H H H H H H H
charge: -0.100316 -0.338320 -0.348909 -0.353080 -0.284442 -0.438013 -0.441954 -0.401673 -0.411829 -0.377116 -0.707569 -0.391644 -0.387021 -0.384293 -0.373940 -0.353647 -0.356380 -0.691551 0.248890 0.261135 0.262155 0.255044 0.261596 0.260627 0.263340 0.248664 0.256810 0.234219 0.240980 0.256337 0.260242 0.213879 0.223695 0.224032 0.202273 0.209080 0.267820 0.243963 0.245392 0.205309 0.200997 0.198592 0.202256 0.195763 0.197952 0.193738 0.192034 0.189395 0.190245 0.196361 0.195821 0.210599 0.222174 0.210290
chargesum: 1.00000
title: Mulliken charges with hydrogens summed into heavy atoms:
elementType: N C C C C C C C C C C C C C C C C C
charge: -0.100316 0.171705 0.168290 0.169142 0.227562 0.053017 0.055362 0.072448 0.035898 0.034237 0.049606 0.014662 0.013826 0.009422 0.011832 0.025993 0.035802 -0.048488
polarizability: 2.31124815e+02 -3.76687754e+00 1.71996798e+02 -2.14810717e+00 3.34240076e-01 1.59386524e+02
1716.lowfreq: -24.1468 -3.3324 -0.0010 -0.0004 0.0018 3.5903 10.6253 19.5710 32.0328
frequency: 5.5658 19.3300 31.9958 43.7918 61.5975 77.2584 87.5194 94.0668 109.4683 121.9171 138.7551 148.1389 154.1013 155.3365 168.1286 211.3280 231.1478 236.7306 271.4678 288.6967 301.8973 321.9396 347.9936 360.2453 380.6948 428.5354 442.2083 462.8840 475.0889 487.7330 515.3861 555.5808 688.7788 721.3371 724.2846 732.7148 748.8124 768.6147 784.9419 791.7346 815.0397 832.9338 847.4655 865.6505 885.2204 889.7771 913.2189 919.1009 932.1821 969.3988 986.8725 987.9329 1000.8760 1002.4697 1027.2509 1030.6693 1041.5801 1047.7744 1054.5267 1067.2572 1076.0935 1079.6435 1085.2843 1095.0974 1113.0695 1120.8516 1128.5345 1159.3389 1174.4118 1177.2162 1188.1812 1200.9871 1213.6412 1222.6259 1247.2459 1252.4548 1262.2997 1274.4018 1277.7840 1280.7105 1281.9507 1285.7935 1291.9720 1297.5628 1300.9104 1309.0677 1312.0051 1328.4247 1334.8947 1337.0798 1344.5130 1348.7267 1350.3590 1354.2110 1355.9587 1357.2445 1369.2139 1371.6365 1390.9858 1395.4196 1412.1136 1457.8753 1458.9972 1459.9786 1462.3721 1463.7835 1464.7572 1466.4001 1468.7319 1473.1819 1473.8004 1474.8670 1478.2438 1479.0708 1481.1467 1483.6565 1486.4442 1488.3095 1492.4636 1498.2140 2951.0427 2951.8292 2954.4725 2957.3339 2961.5181 2966.9645 2969.4805 2974.9402 2986.0893 2988.6977 2991.7406 2993.0904 2999.2357 3006.3101 3007.4777 3008.1861 3008.9498 3016.4096 3020.8111 3022.3544 3030.6270 3032.8458 3037.3742 3043.0610 3054.9700 3061.2748 3063.0105 3070.8281 3076.3653 3077.1556 3088.0009 3096.2443 3099.5378 3103.9163 3110.1636 3117.7683
redmass: 2.2792 2.3209 3.4207 3.3628 1.5923 3.2466 3.1501 2.1937 1.9082 2.6288 1.8517 2.4939 2.4256 2.2511 2.7906 2.7421 1.1120 1.6035 1.7222 2.3709 2.7459 2.2827 2.9104 1.8577 3.0849 2.9181 2.5520 3.0470 2.4094 2.9807 2.8832 1.7323 3.0108 1.0591 1.0708 1.0977 1.1792 1.4515 1.3366 1.3464 1.9156 1.5530 1.7969 1.9383 2.0709 1.9037 1.4655 1.8441 1.4842 1.3681 2.7572 2.7452 3.3081 1.9158 1.3723 2.6672 2.5521 2.9507 2.2191 2.7858 2.3929 2.1699 2.3872 2.0998 1.9583 2.1440 1.6207 1.5498 1.8271 1.8713 1.6204 1.5015 1.3138 1.4545 1.2943 1.3086 1.2574 1.1625 1.2180 1.2302 1.0485 1.1689 1.0562 1.1409 1.0900 1.2256 1.2113 1.2923 1.3862 1.2650 1.3139 1.4774 1.4697 1.3908 1.6538 1.5194 1.3562 1.3309 1.2151 1.3212 1.2155 1.0778 1.0761 1.0728 1.0720 1.0742 1.0793 1.0791 1.0789 1.0796 1.0785 1.0750 1.0460 1.0760 1.0652 1.0761 1.0763 1.0921 1.0892 1.0762 1.0588 1.0588 1.0593 1.0593 1.0593 1.0592 1.0588 1.0361 1.0969 1.0586 1.0984 1.0675 1.1003 1.0623 1.0383 1.0626 1.1017 1.0622 1.1034 1.0635 1.0612 1.1039 1.0635 1.1038 1.1032 1.0989 1.0974 1.1007 1.0992 1.1004 1.1042 1.0991 1.1022 1.1043 1.1033 1.1028
irintensity: 0.0092 0.0265 0.1549 0.3042 0.0286 0.2274 0.1698 0.0158 0.1079 0.0580 0.1909 0.1096 0.2087 0.6611 0.7386 0.0744 0.0007 0.1883 0.0789 0.0630 0.2893 0.0600 0.1523 0.0120 0.3021 0.8025 0.2539 0.1146 1.3510 0.4582 0.2888 5.2826 0.5221 17.3304 0.6566 8.9723 2.2447 9.8969 8.5008 15.9835 7.0525 0.8028 6.3445 24.2420 0.6764 5.0090 2.6106 1.3553 16.9845 1.8093 8.2927 4.3722 4.2925 7.4304 1.9491 2.7011 13.0506 4.7697 6.3356 1.7460 2.7222 1.2137 2.5073 8.3283 3.5184 12.8181 2.2435 0.9485 3.1673 1.5877 1.9231 6.6414 14.6048 0.4420 1.9618 0.3399 3.1979 1.1030 1.2835 1.5859 1.8371 3.5710 0.1666 0.7602 0.4218 4.0873 1.8324 5.8242 0.9025 2.7362 0.9786 1.9690 0.5923 1.3198 0.1307 1.2228 3.3353 1.5549 11.1823 0.0926 33.1351 13.1151 0.0586 7.2556 2.9980 3.4225 2.7259 15.5903 0.5588 12.0236 3.4981 10.2222 10.8777 5.2112 17.0317 2.1383 7.1338 27.2385 56.2502 10.7384 0.0373 0.3046 1.3376 1.6511 6.7015 7.2180 198.2558 38.7721 0.1286 27.0808 0.0971 15.0116 0.0542 14.9678 2.1610 15.9783 0.2315 6.3374 1.2297 8.7312 16.4022 2.7384 10.6766 120.4484 85.1982 10.5598 21.3787 89.9877 48.0310 24.3443 0.1598 4.6974 7.7034 23.5427 19.3013 25.7716
temp: 298.150 k
press: 1.00000 atm
elementType: 7 6 6 6 6 6 6 6 6 6 6 6 6 6 6 6 6 6 1 1 1 1 1 1 1 1 1 1 1 1 1 1 1 1 1 1 1 1 1 1 1 1 1 1 1 1 1 1 1 1 1 1 1 1
symmnumber: 1
zpe: 1324787.8 jmol-1
zpe.correction: 0.504585 hartree
zpe.thermalcorrener: 0.527021 hartree
zpe.thermalcorrenthalpy: 0.527965 hartree
zpe.thermalcorrgfe: 0.449388 hartree
zpe.sumelectzpe: -722.414768 hartree
zpe.sumelectthermal: -722.392332 hartree
zpe.sumelectthermalent: -722.391388 hartree
zpe.sumelectthermalfe: -722.469965 hartree
dipole: 16.1706 1.3296 0.4243
dipole: 16.2308
quadrupole: -30.1700 -99.8356 -107.7701
quadrupole: 3.3167 1.6745 -0.6195
quadrupole: 49.0885 -20.5770 -28.5115 3.3167 1.6745 -0.6195
hfenergy: -722.9193528 hartree
pointgroup: C01 [X(C17H36N1)]
dipole: -6.3598416 0.5084223 -0.2659039 debye
polarizability: 231.1607747|3.2966168|171.631913|-2.3729249|-2.077807|159.7154491 unknown
InChI: InChI=1S/C17H36N/c1-3-5-6-7-8-9-10-12-15-18(4-2)16-13-11-14-17-18/h3-17H2,1-2H3
charge 1 multiplicity 1
54 atoms
N  -3.694804 0.452559 -0.243506
C  -4.016629 -0.629973 -1.305265
C  -4.825815 0.450623 0.816642
C  -2.336345 0.184751 0.451661
C  -3.685481 1.820451 -0.976657
C  -4.252962 -2.024668 -0.705203
C  -5.075583 -0.933774 1.438452
C  -5.37105 -2.000608 0.362093
C  -1.084269 0.283492 -0.434615
C  0.179066 -0.045189 0.405507
C  -3.34596 3.034366 -0.105215
C  1.489001 0.142121 -0.39352
C  2.74981 -0.182025 0.439711
C  4.065507 0.052429 -0.336296
C  5.327459 -0.268154 0.496344
C  6.644645 -0.012442 -0.270307
C  7.907351 -0.332471 0.562172
C  9.218544 -0.070273 -0.20941
H  -4.929381 -0.277087 -1.819212
H  -3.188142 -0.625132 -2.031862
H  -4.551409 1.192812 1.583241
H  -5.731788 0.803474 0.290406
H  -2.275637 0.909396 1.282032
H  -2.405564 -0.821169 0.893934
H  -2.965304 1.717552 -1.805207
H  -4.69326 1.927266 -1.415693
H  -4.530837 -2.693666 -1.540296
H  -3.317968 -2.437716 -0.282643
H  -4.222911 -1.241978 2.071369
H  -5.93769 -0.827888 2.122422
H  -5.470524 -2.994709 0.830327
H  -6.341856 -1.779395 -0.124314
H  -1.135798 -0.421995 -1.285942
H  -0.970981 1.30085 -0.854355
H  0.207676 0.60665 1.303218
H  0.120009 -1.089239 0.775055
H  -3.380869 3.930142 -0.750086
H  -2.330815 2.986463 0.322394
H  -4.071252 3.199046 0.708377
H  1.470438 -0.502682 -1.296379
H  1.551728 1.189031 -0.756386
H  2.75396 0.441149 1.35833
H  2.70769 -1.237898 0.778844
H  4.109759 1.109299 -0.673015
H  4.067459 -0.568098 -1.256628
H  5.294056 -1.328797 0.822313
H  5.320932 0.342555 1.423457
H  6.681755 1.048634 -0.594895
H  6.655979 -0.621743 -1.19826
H  7.872672 -1.393209 0.884577
H  7.89598 0.27494 1.49026
H  9.27169 -0.689105 -1.124872
H  10.104538 -0.305461 0.407784
H  9.293684 0.989893 -0.516586
