program: Gaussian 09
title: 000211630
version: EM64L-G09RevD.01
frameworkgroup: C1[X(C16H34N)]
method: RPBEPBE
basis: SDD
operation: Freq
keyword: #p
keyword: freq=noraman
keyword: PBEPBE/SDD
title: #p freq=noraman PBEPBE/SDD
converged: NO YES NO NO
title: Mulliken charges:
elementType: N C C C C C C C C C C C C C C C C H H H H H H H H H H H H H H H H H H H H H H H H H H H H H H H H H H
charge: -0.092978 -0.339300 -0.345544 -0.347450 -0.303952 -0.444554 -0.448398 -0.399741 -0.419279 -0.377381 -0.698849 -0.389897 -0.384122 -0.375138 -0.353769 -0.356328 -0.690563 0.261241 0.253602 0.258279 0.262568 0.258414 0.263128 0.257012 0.262261 0.233312 0.257501 0.256823 0.237388 0.213751 0.260102 0.232910 0.224779 0.206830 0.206131 0.244416 0.238226 0.266881 0.202853 0.201638 0.199220 0.199560 0.194470 0.193879 0.190905 0.191004 0.196555 0.196313 0.210979 0.223523 0.210787
chargesum: 1.00000
title: Mulliken charges with hydrogens summed into heavy atoms:
elementType: N C C C C C C C C C C C C C C C C
charge: -0.092978 0.175544 0.175302 0.174092 0.215321 0.046258 0.045814 0.074113 0.038410 0.035580 0.050674 0.014595 0.014658 0.013210 0.028140 0.036541 -0.045274
polarizability: 2.24190123e+02 -3.09878307e+00 1.56136989e+02 1.14420843e+00 6.41669736e-01 1.50053249e+02
1716.lowfreq: -45.6540 -12.7075 -9.4106 -0.0010 0.0010 0.0014 6.5004 9.4336 30.0454
frequency: -40.8069 7.1128 29.7222 44.8455 56.0749 78.4730 89.1917 95.2178 108.9169 132.3343 140.3947 151.7690 158.5135 177.7974 208.7499 232.7867 257.2953 284.8382 302.3146 320.6651 331.5721 337.0749 371.8604 410.2773 439.4967 458.6299 479.0169 487.0858 500.6653 586.1753 671.7461 720.0369 725.9744 740.9701 761.0412 772.9865 782.1603 802.6864 821.2442 849.5718 861.9899 878.8577 890.2122 900.1399 913.0951 934.1978 961.2683 985.0525 992.0695 1007.5977 1011.4342 1021.7337 1028.9958 1036.6091 1049.9414 1060.3583 1072.2812 1077.3475 1083.7470 1094.8401 1113.0775 1119.4584 1130.6822 1163.0565 1171.9698 1177.5260 1188.6289 1200.6918 1216.2008 1226.2592 1253.0568 1257.1200 1263.3057 1277.2398 1282.6761 1283.9310 1289.1985 1292.3428 1297.0651 1302.1080 1307.6751 1321.2540 1330.4619 1334.3276 1343.3912 1345.9694 1352.4000 1353.3374 1353.7440 1356.5946 1369.8818 1375.9553 1391.4513 1397.2156 1409.2577 1453.3942 1459.2821 1459.8054 1463.1527 1463.8614 1465.5532 1467.2321 1471.5961 1472.4270 1477.6771 1478.9228 1479.5005 1479.8717 1483.9002 1487.6050 1488.9836 1494.9245 1497.5884 2951.5686 2953.0588 2956.2297 2960.5793 2966.5094 2969.3690 2975.5465 2986.2926 2989.7046 2993.6564 2993.8203 3003.5381 3003.6529 3004.6447 3007.9568 3015.9963 3017.1582 3018.9091 3024.1808 3029.6919 3041.3029 3046.5896 3054.3053 3060.2940 3062.1590 3071.1691 3077.0235 3077.1021 3088.6508 3094.2511 3097.5843 3100.6444 3104.3088 3121.6055
redmass: 1.5869 3.6589 3.6697 2.9831 1.6702 2.4105 3.3502 2.8787 1.7633 2.2912 1.9776 2.0990 4.0206 2.9508 1.7808 1.1052 2.0317 1.6523 2.4858 2.7521 2.1428 2.6065 2.2919 2.6024 2.4250 3.0298 2.7364 2.7102 2.4907 2.0224 3.2336 1.0612 1.0778 1.1051 1.2807 1.3964 1.4645 1.5719 1.4051 2.1272 1.9357 1.8645 1.8992 1.5892 2.1234 1.5082 1.2413 2.9311 2.3988 2.8869 2.5583 1.1657 2.9375 3.4637 2.1008 2.9807 2.6222 2.3387 2.3448 1.7558 1.9456 2.1869 1.6672 1.8769 1.5889 1.7702 1.5900 1.4974 1.3260 1.3991 1.2851 1.2794 1.2448 1.1418 1.1200 1.1052 1.2841 1.1000 1.1327 1.1014 1.1477 1.3362 1.3108 1.2754 1.4418 1.3649 1.4826 1.6471 1.4861 1.3193 1.3438 1.3163 1.2139 1.3227 1.2168 1.0781 1.0733 1.0727 1.0666 1.0783 1.0827 1.0822 1.0787 1.0796 1.0743 1.0477 1.0660 1.0749 1.0882 1.0898 1.0546 1.0808 1.0824 1.0587 1.0586 1.0590 1.0590 1.0590 1.0587 1.0361 1.0970 1.0585 1.0683 1.0984 1.0618 1.1004 1.0396 1.0623 1.0991 1.0641 1.0633 1.0630 1.1041 1.1041 1.0638 1.1029 1.0984 1.0971 1.1007 1.0993 1.1003 1.1058 1.0989 1.1016 1.1015 1.1048 1.1038
irintensity: 0.0043 0.0313 0.0041 0.3047 0.1988 0.0507 0.6299 0.5436 0.0360 0.2061 0.0526 0.3943 1.0758 0.1002 0.0501 0.0005 0.2202 0.1952 0.3856 0.1124 0.0483 0.0677 0.1637 0.6204 0.1666 0.1007 0.4640 1.5623 0.9177 3.4045 1.2359 14.8247 0.4771 8.7548 4.8566 11.7113 19.6944 6.3373 0.9204 3.3272 13.3801 11.7611 5.5223 1.4892 17.8561 19.6545 0.8160 4.8754 6.7808 0.7998 0.9490 0.9967 9.4878 13.3747 3.4100 1.0145 5.6286 0.0528 2.5422 6.1942 1.2560 21.1897 0.4537 3.9613 1.9274 1.0908 2.4791 5.0597 12.3254 0.6913 0.7375 1.8154 3.3286 1.0114 2.4209 2.7976 2.8185 0.8565 1.2361 0.2473 4.7028 1.9327 3.1222 5.6109 0.2832 2.5870 0.2290 1.2961 0.0532 0.8904 1.5469 2.2878 11.2949 7.1775 25.4943 5.6299 0.2766 1.6212 0.8755 13.6573 12.4885 7.5609 15.1220 9.8818 7.4565 9.5039 36.2419 4.1019 2.4365 27.3856 8.2423 43.4738 0.6619 0.1302 0.8435 1.9477 4.5495 3.3662 171.3764 37.5604 0.0140 26.0895 13.0686 0.2815 19.0792 0.4140 1.3538 13.1427 1.7785 7.9469 4.0153 17.7081 2.5395 94.0752 16.2788 57.5061 11.3012 18.4498 86.2373 46.3211 26.3964 19.1445 9.4093 3.2030 16.0731 16.1761 24.8419
temp: 298.150 k
press: 1.00000 atm
elementType: 7 6 6 6 6 6 6 6 6 6 6 6 6 6 6 6 6 1 1 1 1 1 1 1 1 1 1 1 1 1 1 1 1 1 1 1 1 1 1 1 1 1 1 1 1 1 1 1 1 1 1
symmnumber: 1
zpe: 1250707.1 jmol-1
zpe.correction: 0.476369 hartree
zpe.thermalcorrener: 0.496682 hartree
zpe.thermalcorrenthalpy: 0.497626 hartree
zpe.thermalcorrgfe: 0.425005 hartree
zpe.sumelectzpe: -683.192078 hartree
zpe.sumelectthermal: -683.171766 hartree
zpe.sumelectthermalent: -683.170821 hartree
zpe.sumelectthermalfe: -683.243443 hartree
dipole: 13.4651 0.4254 0.0609
dipole: 13.4720
quadrupole: -38.2589 -96.6004 -101.5487
quadrupole: -0.2916 0.8363 -0.7253
quadrupole: 40.5437 -17.7977 -22.7460 -0.2916 0.8363 -0.7253
hfenergy: -683.6684474 hartree
pointgroup: C01 [X(C16H34N1)]
dipole: -5.2977553 -0.1581558 -0.0423956 debye
polarizability: 224.1979606|-3.0092241|156.192098|-1.1018909|0.3660148|149.9903023 unknown
InChI: InChI=1S/C16H34N/c1-3-5-6-7-8-9-11-14-17(4-2)15-12-10-13-16-17/h3-16H2,1-2H3
charge 1 multiplicity 1
51 atoms
N  -2.968506 -0.121031 0.032501
C  -4.00142 -0.515863 1.118809
C  -3.193718 1.364998 -0.344515
C  -1.559694 -0.281064 0.665232
C  -3.111322 -0.999631 -1.235306
C  -5.455436 -0.229686 0.714681
C  -4.643356 1.679359 -0.752686
C  -5.652795 1.255662 0.337054
C  -0.358213 0.019021 -0.243186
C  0.96229 -0.180273 0.548077
C  -2.827773 -2.492896 -1.033471
C  2.21539 0.1167 -0.307097
C  3.534124 -0.095383 0.470393
C  4.791844 0.206432 -0.375515
C  6.11108 -0.011223 0.399306
C  7.370509 0.290602 -0.444731
C  8.68366 0.072398 0.336869
H  -3.834209 -1.580013 1.350971
H  -3.730427 0.076523 2.011768
H  -2.912091 1.946656 0.552001
H  -2.484548 1.603459 -1.153241
H  -1.551526 0.393631 1.54092
H  -1.509778 -1.31753 1.040798
H  -4.137103 -0.852294 -1.60495
H  -2.422869 -0.56629 -1.979634
H  -5.775768 -0.889694 -0.113294
H  -6.090931 -0.495998 1.579154
H  -4.698591 2.769795 -0.926311
H  -4.893369 1.206246 -1.720388
H  -5.515733 1.887527 1.237031
H  -6.684437 1.425221 -0.01549
H  -0.388944 1.059212 -0.618845
H  -0.342673 -0.652002 -1.123019
H  0.965835 0.479492 1.440015
H  1.016622 -1.222322 0.925023
H  -1.790877 -2.698493 -0.719915
H  -3.51906 -2.971734 -0.319809
H  -2.975963 -2.996161 -2.005234
H  2.172423 1.162518 -0.675528
H  2.213145 -0.533776 -1.206312
H  3.58251 -1.142389 0.835525
H  3.538234 0.550462 1.37309
H  4.749723 1.254951 -0.737517
H  4.79006 -0.436126 -1.28082
H  6.157825 -1.059674 0.761163
H  6.117427 0.63074 1.305027
H  7.324686 1.33778 -0.807458
H  7.366613 -0.352062 -1.348852
H  8.731769 0.729039 1.225886
H  9.567179 0.289961 -0.290039
H  8.768781 -0.973374 0.687468
