program: Gaussian 09
title: 000211628
version: EM64L-G09RevD.01
frameworkgroup: C1[X(C15H32N)]
method: RPBEPBE
basis: SDD
operation: Freq
keyword: #p
keyword: freq=noraman
keyword: PBEPBE/SDD
title: #p freq=noraman PBEPBE/SDD
converged: NO YES NO NO
title: Mulliken charges:
elementType: N C C C C C C C C C C C C C C C H H H H H H H H H H H H H H H H H H H H H H H H H H H H H H H H
charge: -0.092946 -0.339218 -0.345441 -0.347463 -0.303921 -0.444397 -0.448578 -0.399726 -0.419081 -0.376394 -0.698743 -0.386849 -0.374758 -0.354983 -0.356106 -0.689339 0.261358 0.253538 0.258282 0.262502 0.258394 0.263021 0.262218 0.257059 0.233349 0.257536 0.256843 0.237474 0.213697 0.260161 0.232843 0.224733 0.205699 0.206372 0.266899 0.244284 0.238350 0.200512 0.201897 0.196483 0.197024 0.191722 0.192545 0.197651 0.197401 0.211142 0.225719 0.211236
chargesum: 1.00000
title: Mulliken charges with hydrogens summed into heavy atoms:
elementType: N C C C C C C C C C C C C C C C
charge: -0.092946 0.175678 0.175343 0.173952 0.215356 0.046488 0.045739 0.074132 0.038495 0.035677 0.050790 0.015560 0.018748 0.029284 0.038946 -0.041243
polarizability: 2.07684951e+02 -2.75965360e+00 1.47654371e+02 1.82480125e+00 6.01931097e-01 1.41067709e+02
1716.lowfreq: -47.7910 -13.7547 -9.9556 0.0003 0.0009 0.0014 6.1985 14.6007 36.6560
frequency: -42.5138 11.0356 36.4693 53.4408 63.3304 84.5492 102.5246 107.2357 123.0555 138.8986 155.2849 169.0236 195.8448 218.9269 228.5904 274.5680 293.8839 303.5053 330.9268 343.7961 356.2912 396.8838 437.2700 446.6471 472.0464 487.6687 502.7888 586.6890 671.4656 720.5602 729.3865 747.8234 767.8921 781.8678 785.5747 812.2933 847.8720 849.6886 872.8263 889.9231 890.0535 913.1790 933.8813 945.8337 987.2750 994.2219 1007.5577 1013.9047 1018.6429 1033.2291 1044.7627 1049.6398 1069.7769 1075.1478 1081.1166 1094.3878 1112.9940 1118.2023 1130.6136 1162.9947 1172.1219 1177.3102 1190.4714 1202.4678 1221.4509 1233.9972 1258.7755 1264.5394 1268.9525 1278.5652 1284.3841 1288.4374 1296.9357 1300.1343 1301.8490 1308.9396 1330.2279 1333.4603 1335.2778 1345.8518 1350.4909 1352.8666 1353.4494 1356.4433 1369.9945 1376.0261 1391.4691 1396.6429 1408.5857 1452.9659 1459.6258 1460.3617 1463.9498 1464.9301 1466.8549 1469.4420 1471.3269 1475.8703 1478.5753 1479.3083 1479.7855 1482.7589 1487.3161 1488.8880 1495.0287 1497.6291 2952.7840 2954.9152 2959.5505 2965.9243 2970.0670 2976.2825 2988.3766 2989.0954 2993.9964 2997.9897 3003.7980 3004.6662 3007.7700 3010.7859 3016.4786 3018.6083 3024.0623 3026.1257 3039.8394 3046.3593 3053.8092 3060.4785 3061.9549 3071.3962 3077.2891 3079.0174 3088.2291 3094.3469 3097.4001 3100.6254 3103.9068 3121.3070
redmass: 1.5885 3.4723 3.5690 3.0077 1.6921 2.2956 2.7232 3.0783 1.8410 2.2126 1.9192 3.9398 2.7259 1.7993 1.1071 1.6450 2.0614 2.4663 2.1207 2.4506 2.8131 2.3494 2.6976 2.6233 2.5975 2.8076 2.5329 2.0068 3.2273 1.0627 1.0823 1.1399 1.4386 1.5089 1.3017 1.6936 1.4291 2.2171 2.0908 1.8133 1.9422 2.1798 1.5015 1.2606 2.0083 3.8867 2.4755 1.5245 1.7045 3.4137 3.3222 2.1074 2.5695 2.5628 2.3146 1.7573 1.9745 2.1181 1.6579 1.8622 1.5927 1.7757 1.5473 1.5137 1.3173 1.3536 1.2593 1.2882 1.2157 1.1495 1.0427 1.1701 1.1047 1.1294 1.2483 1.1699 1.3153 1.2668 1.3867 1.3686 1.4916 1.5827 1.4712 1.3256 1.3417 1.3158 1.2126 1.3235 1.2169 1.0779 1.0745 1.0700 1.0744 1.0783 1.0820 1.0781 1.0795 1.0761 1.0441 1.0641 1.0747 1.0854 1.0881 1.0555 1.0820 1.0824 1.0587 1.0587 1.0590 1.0590 1.0589 1.0362 1.0962 1.0594 1.0679 1.0996 1.0595 1.0409 1.0623 1.1021 1.0606 1.0629 1.0648 1.1015 1.1041 1.0637 1.1029 1.0987 1.0969 1.1008 1.1003 1.0992 1.1058 1.0989 1.1017 1.1015 1.1049 1.1039
irintensity: 0.0095 0.0720 0.0282 0.4519 0.0214 0.1897 0.5885 0.5944 0.0677 0.0760 0.3316 0.8590 0.0674 0.1551 0.0004 0.0625 0.2405 0.3232 0.0732 0.0526 0.3080 0.5564 0.4361 0.0748 0.2947 1.5703 1.0016 3.3478 1.2777 13.6745 0.7143 9.8439 10.7458 24.2371 0.1223 3.5822 5.9308 5.1425 18.9148 0.2606 4.1991 20.4507 17.5020 1.7804 9.2502 2.2296 2.3196 3.0449 1.9685 16.1180 2.4861 3.5311 5.8152 2.6383 0.9694 5.8515 3.0322 19.7281 0.3986 3.7379 1.8111 1.7252 2.7775 4.1451 9.9837 0.5835 1.2223 4.8174 0.9752 1.8495 3.8128 2.0332 0.4820 0.5785 2.6501 3.9862 3.1304 1.7677 5.9465 2.5471 0.1343 0.2995 0.2795 0.8500 1.4897 2.2530 11.4179 6.9970 25.6395 5.5741 0.4275 2.0293 1.6516 12.1216 22.1817 0.9036 22.5852 1.5405 12.2019 36.2940 4.7055 3.8742 23.3527 7.2750 44.4962 2.1568 0.6127 1.1487 3.9419 6.0735 134.1151 36.3660 0.5558 25.9659 13.1631 0.0711 19.6157 1.2070 13.2381 0.4727 8.7120 4.3126 16.3629 2.2833 65.2499 14.5618 52.2700 10.3967 19.1527 84.4133 26.0994 44.3153 19.6036 9.0758 3.1161 15.6114 16.5493 24.8869
temp: 298.150 k
press: 1.00000 atm
elementType: 7 6 6 6 6 6 6 6 6 6 6 6 6 6 6 6 1 1 1 1 1 1 1 1 1 1 1 1 1 1 1 1 1 1 1 1 1 1 1 1 1 1 1 1 1 1 1 1
symmnumber: 1
zpe: 1177470.7 jmol-1
zpe.correction: 0.448475 hartree
zpe.thermalcorrener: 0.467381 hartree
zpe.thermalcorrenthalpy: 0.468325 hartree
zpe.thermalcorrgfe: 0.399705 hartree
zpe.sumelectzpe: -643.969012 hartree
zpe.sumelectthermal: -643.950106 hartree
zpe.sumelectthermalent: -643.949162 hartree
zpe.sumelectthermalfe: -644.017782 hartree
dipole: 10.9453 0.4484 0.0761
dipole: 10.9547
quadrupole: -46.3322 -90.2342 -94.9356
quadrupole: -0.5211 -0.1799 -0.7297
quadrupole: 30.8352 -13.0669 -17.7683 -0.5211 -0.1799 -0.7297
hfenergy: -644.4174868 hartree
pointgroup: C01 [X(C15H32N1)]
dipole: -4.3053627 0.1959463 0.0301045 debye
polarizability: 207.7346861|2.2370671|147.6720099|1.6632294|0.322542|141.0003348 unknown
InChI: InChI=1S/C15H32N/c1-3-5-6-7-8-10-13-16(4-2)14-11-9-12-15-16/h3-15H2,1-2H3
charge 1 multiplicity 1
48 atoms
N  -2.422972 0.139866 -0.01997
C  -3.467014 0.527629 -1.098156
C  -2.65612 -1.338111 0.382921
C  -1.021663 0.277005 -0.674361
C  -2.540491 1.038435 1.236203
C  -4.917776 0.260701 -0.66999
C  -4.103061 -1.634472 0.813602
C  -5.122863 -1.217449 -0.269057
C  0.189696 -0.019353 0.22204
C  1.500423 0.153925 -0.591353
C  -2.25205 2.526891 1.00728
C  2.763002 -0.141865 0.25017
C  4.072313 0.047487 -0.548939
C  5.33943 -0.252146 0.283525
C  6.649208 -0.055458 -0.513717
C  7.911496 -0.352759 0.323375
H  -3.293392 1.586558 -1.348632
H  -3.213582 -0.080764 -1.985473
H  -2.390589 -1.935901 -0.507909
H  -1.938992 -1.570284 1.186462
H  -1.031813 -0.411779 -1.539007
H  -0.967541 1.306834 -1.067375
H  -1.842299 0.612637 1.975821
H  -3.560955 0.902194 1.624603
H  -5.220563 0.934866 0.153135
H  -5.562914 0.520854 -1.529164
H  -4.164855 -2.722004 1.002678
H  -4.337507 -1.146742 1.777965
H  -5.002439 -1.862814 -1.161771
H  -6.151261 -1.37338 0.098903
H  0.154535 -1.052742 0.615631
H  0.223772 0.666195 1.090131
H  1.559441 1.189211 -0.985818
H  1.484487 -0.520001 -1.472528
H  -2.379768 3.045118 1.974052
H  -1.219787 2.721558 0.67216
H  -2.953271 2.999466 0.299147
H  2.779165 0.521469 1.139799
H  2.71626 -1.181791 0.634401
H  4.124112 1.088578 -0.930266
H  4.058477 -0.611653 -1.441943
H  5.356793 0.403201 1.179436
H  5.295997 -1.295031 0.661155
H  6.634904 -0.711731 -1.407773
H  6.692887 0.985879 -0.892901
H  7.971957 0.313943 1.204049
H  8.831552 -0.208323 -0.270941
H  7.909134 -1.39595 0.691403
