program: Gaussian 09
title: 000216854
version: EM64L-G09RevD.01
frameworkgroup: C1[X(C10H22ClN2O5PS)]
method: RPBEPBE
basis: SDD
operation: Freq
keyword: #p
keyword: freq=noraman
keyword: PBEPBE/SDD
title: #p freq=noraman PBEPBE/SDD
converged: YES YES NO NO
title: Mulliken charges:
elementType: Cl S P O O O O O N N C C C C C C C C C C H H H H H H H H H H H H H H H H H H H H H H
charge: -0.088179 1.007199 1.377101 -0.465038 -0.626083 -0.396227 -0.518098 -0.563071 -0.542473 -0.693286 -0.335952 -0.367268 -0.298183 -0.334523 -0.288663 -0.300415 -0.551411 -0.259059 -0.648859 -0.669129 0.222699 0.229271 0.233179 0.201892 0.235407 0.214746 0.295144 0.235982 0.358369 0.252822 0.214562 0.240312 0.229440 0.304980 0.255470 0.306310 0.266664 0.239807 0.233142 0.225909 0.232531 0.332983
chargesum: 0.00000
title: Mulliken charges with hydrogens summed into heavy atoms:
elementType: Cl S P O O O O O N N C C C C C C C C C C
charge: -0.088179 1.007199 1.377101 -0.465038 -0.626083 -0.396227 -0.518098 -0.563071 -0.542473 -0.334917 0.116017 0.067803 0.151970 0.196603 0.178721 0.169337 0.009039 0.047251 0.090753 0.122293
polarizability: 2.24926414e+02 -2.06762853e+01 2.21944313e+02 -5.15913234e+00 5.97407851e+00 1.54820315e+02
1716.lowfreq: -20.4834 -0.0012 0.0001 0.0012 2.5789 5.8684 18.8002 21.9206 36.6300
frequency: 2.7996 21.8615 36.1013 46.3542 52.2863 59.2448 68.3972 86.1057 98.1067 105.6819 119.6165 147.9317 158.0232 163.8449 179.5779 196.6270 202.3065 211.7515 226.7593 236.5792 240.4338 258.2962 270.4977 288.4896 305.8518 325.0027 346.1256 355.2567 365.3558 372.7914 406.3009 419.2269 427.0263 444.1609 460.1504 488.0327 508.6361 526.1067 536.7903 607.3218 657.2583 696.5694 770.7475 790.0531 825.4295 829.1749 834.6499 869.3812 874.1786 886.3818 908.0925 921.0203 930.2961 938.5142 949.1144 986.0845 1006.5230 1036.0124 1043.9909 1046.4965 1052.8899 1073.0585 1090.5549 1101.3708 1119.6863 1145.8684 1151.7812 1169.1923 1195.3244 1213.9799 1216.0714 1219.7498 1241.7047 1250.2764 1258.8223 1276.8913 1307.2567 1319.3535 1335.1355 1344.4976 1348.3464 1353.9432 1363.3340 1372.8936 1390.0511 1410.2717 1431.2275 1439.1684 1450.1118 1450.4449 1451.9034 1462.3268 1462.8659 1467.1624 1471.2021 1474.1409 1479.3881 1501.2240 2937.2638 2961.7405 2962.2834 2973.3491 2986.3578 2988.8635 2995.7832 3009.3287 3037.1556 3041.4379 3051.1444 3057.0728 3059.2689 3065.6407 3066.6744 3070.1145 3082.4117 3090.0942 3093.3211 3110.7877 3152.9772 3422.7467
redmass: 5.7942 10.2320 5.9310 3.8030 4.5789 4.3810 5.7813 3.9435 4.5038 2.4610 4.2480 3.4271 2.6733 3.5367 1.4176 4.0481 6.3927 3.4538 4.6401 5.1845 3.5776 3.0799 1.2934 4.3850 2.5230 4.9385 5.6822 2.8662 4.4426 2.7468 3.9957 3.8576 3.2603 4.8134 2.4627 4.8564 2.7057 5.4543 2.0493 6.0134 7.0193 5.6307 1.1505 2.7366 3.9619 3.3364 4.3563 2.7517 1.6476 2.5986 3.1799 1.7413 2.1240 3.0449 1.2606 3.4639 1.6584 10.7822 3.9373 1.3845 1.8970 2.8413 2.1040 1.8446 4.1867 2.2307 1.9404 1.7369 1.2944 1.6770 1.1550 1.2191 1.3500 1.1237 1.2227 1.2719 1.2226 1.5659 1.2134 1.2256 1.2527 1.3653 1.2329 1.2911 1.1900 1.1648 1.1882 1.0912 1.0605 1.1001 1.0769 1.0754 1.0560 1.0684 1.0540 1.0831 1.0767 1.0579 1.0676 1.0531 1.0489 1.0641 1.0647 1.0374 1.0620 1.0607 1.0940 1.0999 1.0987 1.0982 1.0585 1.1006 1.0900 1.1029 1.0969 1.1016 1.0984 1.1005 1.1126 1.0753
irintensity: 1.4699 0.4666 1.4414 2.3850 2.6572 4.4286 2.7545 5.0376 2.2943 2.3446 2.6459 2.8117 7.0545 2.9296 0.7188 14.6090 5.8028 6.0596 16.1387 18.8061 2.4958 10.0127 3.6098 11.4147 5.9919 5.8804 11.2158 12.9900 31.6687 11.9364 14.2844 14.0428 21.6129 19.8350 33.7998 23.9522 81.2580 71.1092 14.0959 36.9163 18.3942 136.7469 10.6736 195.8483 45.5534 106.5058 25.8899 11.0402 29.9657 83.6662 69.3703 12.0511 30.4362 49.3506 16.5941 75.3528 29.4970 83.4435 28.5353 38.8573 70.6865 39.4567 6.9634 33.5984 84.7057 2.8977 48.7772 38.9652 5.6965 58.6791 15.1572 17.9360 13.1860 1.4623 16.5628 7.9779 17.3587 2.6508 2.0485 14.7279 0.5055 1.4024 6.4568 1.6650 32.8884 18.3427 28.2164 14.2323 18.5424 12.1037 4.2525 7.1888 12.4824 8.7423 3.0355 4.3213 19.1229 23.1335 57.0214 52.1049 16.0707 69.2360 38.8950 10.3076 36.6547 12.4715 26.8887 16.3246 12.8579 11.0030 16.0839 40.7106 3.1987 3.2994 5.6292 28.3358 10.6745 12.1151 7.1258 61.8709
temp: 298.150 k
press: 1.00000 atm
elementType: 17 16 15 8 8 8 8 8 7 7 6 6 6 6 6 6 6 6 6 6 1 1 1 1 1 1 1 1 1 1 1 1 1 1 1 1 1 1 1 1 1 1
symmnumber: 1
zpe: 868794.3 jmol-1
zpe.correction: 0.330906 hartree
zpe.thermalcorrener: 0.355991 hartree
zpe.thermalcorrenthalpy: 0.356935 hartree
zpe.thermalcorrgfe: 0.272234 hartree
zpe.sumelectzpe: -2077.422984 hartree
zpe.sumelectthermal: -2077.397900 hartree
zpe.sumelectthermalent: -2077.396956 hartree
zpe.sumelectthermalfe: -2077.481657 hartree
dipole: 1.7404 -2.2969 -0.9976
dipole: 3.0495
quadrupole: -123.8611 -141.7673 -153.6277
quadrupole: -11.0578 -20.5840 4.2504
quadrupole: 15.8909 -2.0153 -13.8756 -11.0578 -20.5840 4.2504
hfenergy: -2077.7538907 hartree
pointgroup: C01 [X(C10H22Cl1N2O5P1S1)]
dipole: -0.7323412 0.9167699 -0.2503733 debye
polarizability: 227.3071863|-21.1738999|219.2780404|3.8120202|5.708273|155.1058152 unknown
InChI: InChI=1S/C10H22ClN2O5PS/c1-10(2)20(15,16)18-9-5-12-19(14)13(7-4-11)6-3-8-17-19/h10,12H,3-9H2,1-2H3
charge 0 multiplicity 1
42 atoms
Cl -0.615481 -4.512356 -1.212706
S  2.828522 0.471719 -0.635397
P  -1.35909 0.301055 0.433378
O  -2.766941 0.998647 1.191334
O  -0.524866 -0.56337 1.481326
O  2.261022 1.647428 0.728266
O  4.04825 1.17088 -1.441866
O  1.531631 0.036997 -1.527978
N  -1.996106 -0.60794 -0.901949
N  -0.608036 1.686833 -0.316654
C  -3.18757 -0.113526 -1.638496
C  -4.292716 0.412508 -0.691923
C  -3.788594 1.526806 0.243317
C  -1.239512 -1.781728 -1.393026
C  0.032424 2.744944 0.490847
C  1.550684 2.852668 0.254586
C  -1.62346 -3.029766 -0.583589
C  3.456293 -0.950137 0.668621
C  4.79589 -1.436907 0.128375
C  2.330862 -1.961564 0.801162
H  -2.900907 0.686151 -2.35643
H  -3.585388 -0.959142 -2.229337
H  -4.682854 -0.4201 -0.078149
H  -5.126546 0.808201 -1.304712
H  -4.589521 1.906234 0.897987
H  -3.350183 2.365568 -0.334616
H  -0.15263 -1.600908 -1.314821
H  -1.46507 -1.926509 -2.465288
H  -0.109423 1.433184 -1.182926
H  -0.153131 2.552024 1.562895
H  -0.414803 3.732697 0.251239
H  1.971657 3.69181 0.839931
H  1.776095 3.04328 -0.815413
H  -1.359189 -2.913238 0.477265
H  -2.679528 -3.313599 -0.706109
H  3.551781 -0.292335 1.549754
H  5.48416 -0.603868 -0.092585
H  4.672819 -2.047319 -0.782374
H  5.262129 -2.072675 0.905436
H  2.620857 -2.670638 1.602514
H  2.18535 -2.543593 -0.125385
H  1.374421 -1.493418 1.098695
