program: Gaussian 09
title: 000211626
version: EM64L-G09RevD.01
frameworkgroup: C1[X(C14H30N)]
method: RPBEPBE
basis: SDD
operation: Freq
keyword: #p
keyword: freq=noraman
keyword: PBEPBE/SDD
title: #p freq=noraman PBEPBE/SDD
converged: NO YES NO NO
title: Mulliken charges:
elementType: N C C C C C C C C C C C C C C H H H H H H H H H H H H H H H H H H H H H H H H H H H H H H
charge: -0.092781 -0.339241 -0.345230 -0.347518 -0.303859 -0.444140 -0.448729 -0.399740 -0.418014 -0.698720 -0.374235 -0.376700 -0.354928 -0.356502 -0.687408 0.253512 0.261415 0.262389 0.258307 0.258368 0.263079 0.257048 0.262210 0.257579 0.233301 0.237506 0.256900 0.260195 0.213745 0.224455 0.232349 0.266953 0.244168 0.238459 0.204907 0.205364 0.197766 0.198964 0.194596 0.194899 0.198053 0.198708 0.228081 0.212057 0.212414
chargesum: 1.00000
title: Mulliken charges with hydrogens summed into heavy atoms:
elementType: N C C C C C C C C C C C C C C
charge: -0.092781 0.175686 0.175465 0.173929 0.215399 0.046740 0.045677 0.074199 0.038790 0.050860 0.036036 0.020031 0.034566 0.040259 -0.034855
polarizability: 1.91277009e+02 -2.62636302e+00 1.39095202e+02 1.13676640e+00 5.70058721e-01 1.31992287e+02
1716.lowfreq: -29.7511 -10.6098 -8.2342 -0.0008 0.0006 0.0010 14.3164 20.2846 44.3636
frequency: -22.5904 19.7602 44.2421 64.9076 81.0594 91.2541 120.8642 128.2486 135.3243 157.4644 189.9705 202.5734 231.8738 235.6396 280.6668 303.1921 316.8852 329.8388 361.0673 399.1274 406.5190 442.0221 475.2842 485.1250 498.4412 585.0214 671.6420 724.0623 737.0897 758.8951 772.9188 782.0160 805.2375 827.1603 849.5710 867.2165 883.7813 892.0295 912.4040 926.2659 935.3053 986.6679 999.4380 1007.7521 1011.9303 1022.2945 1035.7446 1047.6674 1060.4014 1069.1997 1081.9991 1094.6281 1112.5433 1117.1865 1131.0363 1163.4113 1172.0623 1177.7357 1193.1005 1205.8642 1229.7151 1244.6546 1260.9884 1276.1863 1277.8827 1281.7542 1287.7603 1296.2375 1301.5848 1307.9053 1320.1171 1330.3524 1334.2674 1346.0882 1346.8939 1352.7321 1353.8097 1356.7516 1369.8365 1376.2009 1393.8703 1397.3174 1409.1746 1453.3927 1462.2448 1462.6910 1463.3972 1466.5692 1468.6163 1472.5519 1475.0072 1479.2361 1479.6331 1479.7290 1482.3763 1487.7032 1488.2649 1494.9291 1497.2367 2955.2775 2958.5850 2965.7391 2971.2059 2978.4446 2990.2110 2992.2725 2994.0655 3003.4479 3004.1283 3004.9350 3007.4635 3016.9389 3018.8521 3021.5980 3024.4267 3038.5741 3046.5981 3054.6030 3060.2237 3061.8235 3073.7741 3077.3406 3081.3141 3088.2158 3094.4381 3096.7388 3100.9842 3104.6346 3120.8163
redmass: 1.5775 3.4380 3.4649 2.7468 2.2391 1.8484 2.7304 2.7611 1.9034 1.9323 4.1250 2.0779 1.1144 1.8535 1.6507 2.1954 2.4085 2.0439 2.3701 3.0450 2.5458 2.5258 2.5491 2.6826 2.5406 2.0089 3.2392 1.0647 1.0888 1.2509 1.4208 1.4771 1.6695 1.3640 2.1282 2.2265 1.9429 1.9066 2.1508 1.3677 1.4554 1.8377 3.6381 1.4617 1.7634 3.0136 3.4613 2.1508 2.7843 2.4819 2.3825 1.7616 1.9993 2.0621 1.6420 1.8783 1.5881 1.7598 1.5047 1.5133 1.3042 1.2988 1.2508 1.1809 1.2850 1.1488 1.0603 1.1674 1.0886 1.1445 1.3226 1.3077 1.2795 1.3567 1.4611 1.4939 1.5239 1.3173 1.3429 1.3171 1.2117 1.3227 1.2161 1.0779 1.0718 1.0729 1.0783 1.0843 1.0761 1.0778 1.0724 1.0673 1.0480 1.0655 1.0813 1.0646 1.0777 1.0827 1.0838 1.0588 1.0588 1.0591 1.0591 1.0362 1.0586 1.0976 1.0679 1.0575 1.0430 1.1005 1.0623 1.0606 1.0637 1.1013 1.0635 1.1041 1.0634 1.1030 1.0988 1.0967 1.1008 1.1003 1.0992 1.1059 1.0988 1.1017 1.1015 1.1048 1.1040
irintensity: 0.0145 0.1853 0.0773 0.2050 0.5789 0.0026 0.6777 0.3967 0.0722 0.3767 0.5474 0.0333 0.0055 0.1458 0.0859 0.3865 0.0613 0.0675 0.3196 0.2141 0.6760 0.1575 0.3538 1.9526 0.5498 3.5015 1.2437 12.4438 1.6107 10.8458 12.0076 20.2357 2.1901 1.5950 3.3982 23.0342 4.8747 2.2755 17.7676 4.8935 15.0289 7.9742 4.2286 2.6976 0.3469 3.9014 17.3810 6.2449 3.6831 3.0348 2.6235 6.0076 3.0668 17.6211 0.5203 3.8123 1.4356 1.1609 2.5965 2.8397 9.5254 0.5404 2.8506 1.3795 4.5812 2.8971 2.6955 1.4435 0.2209 4.5982 1.1664 3.2779 5.0988 1.2028 3.0807 0.3330 1.1514 0.9212 1.6517 2.3122 11.3026 7.0463 25.3182 6.5048 0.7012 2.9664 14.1491 13.4412 1.8637 26.2243 4.2236 0.3081 16.0317 39.3261 0.9689 22.4364 5.3908 44.7404 0.7792 0.7737 1.9893 3.8593 103.6914 35.3017 26.1507 0.2735 13.0883 19.4005 1.3619 0.2063 13.2223 8.4640 4.3926 0.5469 17.7176 44.2142 12.5016 41.9748 9.9900 19.9422 77.9054 26.0478 41.4577 20.6185 9.2786 3.4734 15.7211 16.0772 24.1581
temp: 298.150 k
press: 1.00000 atm
elementType: 7 6 6 6 6 6 6 6 6 6 6 6 6 6 6 1 1 1 1 1 1 1 1 1 1 1 1 1 1 1 1 1 1 1 1 1 1 1 1 1 1 1 1 1 1
symmnumber: 1
zpe: 1104727.2 jmol-1
zpe.correction: 0.420768 hartree
zpe.thermalcorrener: 0.438214 hartree
zpe.thermalcorrenthalpy: 0.439159 hartree
zpe.thermalcorrgfe: 0.374842 hartree
zpe.sumelectzpe: -604.745734 hartree
zpe.sumelectthermal: -604.728288 hartree
zpe.sumelectthermalent: -604.727344 hartree
zpe.sumelectthermalfe: -604.791660 hartree
dipole: 8.5265 0.4641 0.0719
dipole: 8.5395
quadrupole: -51.7120 -83.8320 -88.3152
quadrupole: -0.4802 0.7826 -0.5956
quadrupole: 22.9077 -9.2122 -13.6955 -0.4802 0.7826 -0.5956
hfenergy: -605.1665027 hartree
pointgroup: C01 [X(C14H30N1)]
dipole: -3.3550474 0.1728551 0.0353379 debye
polarizability: 191.2849157|2.6226891|139.1264207|0.8579506|0.4567844|131.9531614 unknown
InChI: InChI=1S/C14H30N/c1-3-5-6-7-9-12-15(4-2)13-10-8-11-14-15/h3-14H2,1-2H3
charge 1 multiplicity 1
45 atoms
N  -1.894605 0.129213 -0.036364
C  -2.920529 0.501866 -1.137041
C  -2.142112 -1.339773 0.390814
C  -0.482601 0.24644 -0.671754
C  -2.026096 1.051853 1.200816
C  -4.378883 0.251581 -0.724647
C  -3.596895 -1.620267 0.805508
C  -4.598675 -1.217706 -0.299284
C  0.712182 -0.042047 0.249261
C  -1.728316 2.534671 0.947807
C  2.038355 0.105184 -0.544146
C  3.282267 -0.187599 0.325955
C  4.609023 -0.02442 -0.449761
C  5.855217 -0.325193 0.414405
C  7.177379 -0.155628 -0.363647
H  -2.65816 -0.125331 -2.00852
H  -2.737047 1.554708 -1.405427
H  -1.43833 -1.56052 1.2092
H  -1.86692 -1.955462 -0.48476
H  -0.483954 -0.45762 -1.524035
H  -0.415664 1.268798 -1.08195
H  -3.052553 0.926576 1.577009
H  -1.340115 0.637585 1.95814
H  -5.010363 0.499518 -1.597487
H  -4.688864 0.942592 0.081656
H  -3.842628 -1.113682 1.757249
H  -3.667639 -2.703827 1.013459
H  -5.633106 -1.360792 0.056773
H  -4.46943 -1.880228 -1.178054
H  0.737839 0.659529 1.104675
H  0.662052 -1.067431 0.661698
H  -1.867323 3.071689 1.902673
H  -0.690758 2.71895 0.623416
H  -2.417663 2.996405 0.22114
H  2.114202 1.132724 -0.955423
H  2.031813 -0.583991 -1.413527
H  3.287703 0.490524 1.204582
H  3.218089 -1.220351 0.726755
H  4.681647 1.009832 -0.845721
H  4.607566 -0.697234 -1.332558
H  5.857745 0.344748 1.298388
H  5.786649 -1.359867 0.807596
H  8.050605 -0.370768 0.277639
H  7.286295 0.877072 -0.744418
H  7.221099 -0.84012 -1.231389
