program: Gaussian 09
title: 000216851
version: EM64L-G09RevD.01
frameworkgroup: C1[X(C9H20ClN2O5PS)]
method: RPBEPBE
basis: SDD
operation: Freq
keyword: #p
keyword: freq=noraman
keyword: PBEPBE/SDD
title: #p freq=noraman PBEPBE/SDD
converged: YES YES NO NO
title: Mulliken charges:
elementType: Cl S P O O O O O N N C C C C C C C C C H H H H H H H H H H H H H H H H H H H H
charge: -0.094899 1.053921 1.415201 -0.526791 -0.616600 -0.423779 -0.517533 -0.517655 -0.501416 -0.714921 -0.376570 -0.358616 0.010430 -0.306387 -0.687722 -0.359428 -0.554400 -0.194369 -0.735022 0.234895 0.234841 0.199746 0.226238 0.191864 0.250115 0.266806 0.341241 0.237209 0.204190 0.234465 0.273811 0.222875 0.256204 0.299687 0.222500 0.226296 0.288537 0.309604 0.285433
chargesum: 0.00000
title: Mulliken charges with hydrogens summed into heavy atoms:
elementType: Cl S P O O O O O N N C C C C C C C C C
charge: -0.094899 1.053921 1.415201 -0.526791 -0.616600 -0.423779 -0.517533 -0.517655 -0.501416 -0.373680 0.093166 0.067368 0.202294 0.210534 -0.011858 0.137258 0.001491 0.254426 0.148553
polarizability: 2.20633432e+02 -1.43957369e+01 1.83169114e+02 7.20205930e+00 5.24285443e+00 1.59506570e+02
1716.lowfreq: -15.9084 -0.9567 0.0004 0.0015 0.0015 5.6847 11.5333 19.2396 36.9634
frequency: -10.1906 18.4962 36.9397 39.6814 48.4946 56.2300 64.2568 77.4628 89.7317 106.1304 124.1754 150.6900 164.4261 192.3138 206.2946 209.8958 218.0193 222.0356 229.0424 239.1588 251.1711 256.9149 272.8023 284.4820 291.6852 311.1196 352.6469 370.3569 373.1409 404.6830 414.7037 445.7689 448.7741 471.7135 554.8685 560.9440 591.2037 600.7076 654.6722 677.2477 730.1103 781.9224 805.0697 830.8680 833.8043 858.9389 876.5822 903.5769 910.8869 946.7392 972.8580 979.8797 1004.9415 1018.9706 1035.0948 1037.9637 1047.1730 1060.9260 1077.2763 1078.3101 1116.8221 1124.0674 1137.7230 1173.4778 1199.9415 1210.4372 1232.2144 1245.5195 1255.0051 1256.6539 1301.2571 1311.3851 1319.8938 1320.3008 1343.8390 1354.5514 1360.1650 1364.7571 1371.3317 1388.2243 1389.6885 1412.6791 1421.6519 1434.0468 1445.3453 1450.1287 1456.1365 1460.9067 1473.7734 1476.2014 1487.6609 2932.0605 2936.8317 2986.3337 2991.2108 2994.0498 2995.1062 2998.9855 3029.8615 3043.9212 3052.7145 3063.5602 3064.9802 3065.4354 3078.9801 3091.9784 3106.6023 3160.5053 3174.4416 3192.6239 3565.5572
redmass: 4.9955 5.5563 5.9147 6.7158 4.9593 8.0544 4.3711 5.6526 3.4267 2.9513 3.4996 4.4268 1.0606 4.9356 1.1523 4.0456 4.1267 4.4531 2.4621 2.2933 3.6805 3.0244 2.2175 5.3789 5.6338 2.2619 7.9189 5.0876 5.2984 4.4281 5.1400 3.4297 3.9080 3.2406 3.5299 2.9989 9.0459 5.4492 5.6663 5.4927 4.2626 1.1408 3.1324 3.3887 11.0497 2.2455 2.8463 2.4967 2.6464 1.3721 1.6041 1.6538 1.9664 1.3366 2.2901 3.1215 5.3014 2.7710 2.4521 2.7513 1.9264 3.4204 2.1216 2.3922 1.4498 1.1757 1.7297 1.1646 1.3397 1.1133 1.2764 1.2051 1.1706 1.1563 1.2356 1.2620 1.6288 1.2726 1.3057 1.2315 1.2167 1.0515 1.0515 1.0937 1.0722 1.0968 1.0482 1.0819 1.0765 1.0517 1.0716 1.0723 1.0810 1.0566 1.0457 1.0598 1.0512 1.0628 1.0252 1.0927 1.1030 1.0968 1.0639 1.1080 1.0993 1.0989 1.1006 1.1128 1.1081 1.1077 1.0765
irintensity: 4.9400 3.4321 1.4557 1.1805 3.9504 2.6287 2.2612 2.2134 2.7879 0.9631 5.8934 3.9718 0.1374 3.3667 0.8240 0.9458 2.5326 8.0878 23.9659 23.4141 6.0454 13.9725 4.7401 8.7972 16.7943 24.5074 25.5664 9.6030 32.3718 41.4240 28.9604 1.2897 10.7500 2.9737 41.3413 29.4715 26.4921 21.1399 26.4667 137.0349 119.8075 14.8474 76.7653 59.0382 56.2493 59.5702 100.2518 5.6521 62.5240 20.4234 6.2243 32.9680 37.3914 11.9402 71.1427 49.6033 65.5125 19.3029 30.6220 33.0617 59.7168 128.0256 13.2392 38.2086 14.5578 34.2738 24.5524 14.1580 15.5223 30.2103 1.6159 25.0899 4.0418 1.3782 2.2073 7.7935 12.3677 3.4392 4.7460 34.1498 25.9624 9.0481 10.0810 9.2698 16.3848 6.8558 12.4291 17.2177 13.8676 6.4754 25.1140 12.1015 70.0726 5.0037 4.2549 73.5417 38.2465 12.9026 6.7393 16.6598 11.7289 19.6432 19.0049 29.8377 4.1861 27.4434 24.1043 6.2996 8.0213 0.9768 23.3382
temp: 298.150 k
press: 1.00000 atm
elementType: 17 16 15 8 8 8 8 8 7 7 6 6 6 6 6 6 6 6 6 1 1 1 1 1 1 1 1 1 1 1 1 1 1 1 1 1 1 1 1
symmnumber: 1
zpe: 793701.3 jmol-1
zpe.correction: 0.302305 hartree
zpe.thermalcorrener: 0.325572 hartree
zpe.thermalcorrenthalpy: 0.326517 hartree
zpe.thermalcorrgfe: 0.247976 hartree
zpe.sumelectzpe: -2038.185866 hartree
zpe.sumelectthermal: -2038.162598 hartree
zpe.sumelectthermalent: -2038.161654 hartree
zpe.sumelectthermalfe: -2038.240194 hartree
dipole: 1.2739 -2.1099 2.6857
dipole: 3.6452
quadrupole: -129.1310 -135.9965 -149.4101
quadrupole: -8.9260 22.1841 10.4748
quadrupole: 9.0482 2.1827 -11.2309 -8.9260 22.1841 10.4748
hfenergy: -2038.4881704 hartree
pointgroup: C01 [X(C9H20Cl1N2O5P1S1)]
dipole: 0.1791788 0.9889878 -1.0230086 debye
polarizability: 201.9478851|23.3283925|203.1855673|-3.2192105|4.9775667|158.1756635 unknown
InChI: InChI=1S/C9H20ClN2O5PS/c1-9-3-6-12(7-4-10)18(13,17-9)11-5-8-16-19(2,14)15/h9,11H,3-8H2,1-2H3
charge 0 multiplicity 1
39 atoms
Cl 0.199259 -4.186152 0.513529
S  -3.160684 -0.589957 -1.116348
P  1.084831 1.009815 1.196618
O  2.502969 1.975049 0.881665
O  0.922362 0.337653 2.628881
O  -2.36866 0.215213 0.387416
O  -2.058112 -0.68359 -2.301057
O  -4.586573 0.123344 -1.405768
N  1.19181 -0.206831 -0.051093
N  -0.12043 2.233603 0.884197
C  1.688188 0.163563 -1.397984
C  3.049004 0.885424 -1.313947
C  2.967242 2.207014 -0.528652
C  0.38489 -1.434709 0.091226
C  4.307503 2.926007 -0.381014
C  -1.4748 2.181043 1.444987
C  1.281011 -2.616822 0.478433
C  -2.548386 1.682406 0.454578
C  -3.396136 -2.289909 -0.30493
H  1.799291 -0.769938 -1.978356
H  0.9443 0.789907 -1.939676
H  3.404195 1.111647 -2.338445
H  3.7900 0.221017 -0.831717
H  2.225228 2.874118 -1.022923
H  -0.139362 -1.636558 -0.862202
H  -0.378863 -1.292484 0.874266
H  0.227014 3.140388 0.568775
H  4.188174 3.843628 0.218913
H  4.708429 3.200928 -1.374069
H  5.035329 2.272289 0.129456
H  -1.477825 1.534585 2.342831
H  -1.772549 3.19452 1.77816
H  2.071331 -2.823727 -0.258382
H  1.690171 -2.508622 1.492502
H  -2.393621 2.144633 -0.538316
H  -3.566412 1.914184 0.821313
H  -4.050636 -2.120255 0.559354
H  -2.396199 -2.644167 -0.017723
H  -3.860685 -2.922855 -1.073997
