program: Gaussian 09
title: 000216848
version: EM64L-G09RevD.01
frameworkgroup: C1[X(C8H18ClN2O5PS)]
method: RPBEPBE
basis: SDD
operation: Freq
keyword: #p
keyword: freq=noraman
keyword: PBEPBE/SDD
title: #p freq=noraman PBEPBE/SDD
converged: YES YES NO NO
title: Mulliken charges:
elementType: Cl S P O O O O O N N C C C C C C C C H H H H H H H H H H H H H H H H H H
charge: -0.062908 1.035569 1.354711 -0.468579 -0.591723 -0.392936 -0.504522 -0.531820 -0.516232 -0.722739 -0.351529 -0.373062 -0.394358 -0.295715 -0.295949 -0.264576 -0.549607 -0.723078 0.221776 0.256822 0.231323 0.211416 0.270142 0.256901 0.238057 0.204760 0.335246 0.242170 0.283976 0.252345 0.251550 0.265573 0.257875 0.295807 0.284528 0.288785
chargesum: 0.00000
title: Mulliken charges with hydrogens summed into heavy atoms:
elementType: Cl S P O O O O O N N C C C C C C C C
charge: -0.062908 1.035569 1.354711 -0.468579 -0.591723 -0.392936 -0.504522 -0.531820 -0.516232 -0.387492 0.127068 0.069677 0.132686 0.147102 0.230197 0.239320 -0.026158 0.146042
polarizability: 1.98729402e+02 -1.18029664e-01 1.73523710e+02 1.80009518e+00 -3.05182320e+00 1.51197024e+02
1716.lowfreq: -11.1017 -7.4409 -0.0020 -0.0017 -0.0010 6.7201 13.1613 21.3797 23.1067
frequency: 12.7151 20.5674 22.4017 34.0595 39.5980 50.1356 58.9391 71.8154 119.2261 125.4830 147.2801 158.9117 178.4252 195.8172 208.7793 225.4802 229.5674 245.3584 255.3493 276.9303 296.8227 309.6333 323.0850 346.5443 365.1343 389.8473 412.6644 417.7887 433.7284 469.1167 483.4268 531.6724 550.5436 597.8846 616.4286 667.3606 686.3391 757.7896 773.2433 800.8488 822.4366 831.2875 859.6585 898.2765 909.2661 910.4558 928.6207 995.1126 1015.7103 1020.8918 1031.6183 1038.7895 1046.8717 1055.4641 1055.6216 1079.9111 1099.3776 1135.3179 1150.4526 1154.8296 1208.3376 1222.3693 1246.9325 1249.2598 1284.0237 1288.7610 1312.3519 1318.1746 1320.8775 1347.0709 1350.3343 1353.9222 1360.3558 1373.1681 1402.1623 1415.5093 1416.5230 1437.8887 1441.6751 1449.8543 1456.5237 1459.6260 1469.5625 1471.7403 2970.3302 2983.9154 2988.6274 2994.8555 2997.9419 3005.9609 3040.1848 3055.1253 3056.4857 3063.1573 3065.0140 3073.2398 3088.2831 3089.2205 3146.3908 3188.6985 3197.8780 3523.2224
redmass: 9.7302 5.0927 6.1494 4.5147 5.9166 3.1207 6.9673 3.3017 3.9078 3.8696 1.2445 2.0741 4.0539 3.3020 4.9353 4.8147 4.2765 4.7050 4.7043 4.6252 3.0465 6.7897 5.8186 8.7250 2.4488 4.7727 4.7052 5.7281 4.6047 6.8964 5.3602 1.8828 1.6418 7.9680 6.3656 6.1894 5.5012 1.6247 1.2553 1.8971 3.0973 11.8793 1.6296 3.2832 4.8919 3.0982 2.3398 1.3441 1.3807 2.6252 3.5640 2.0107 7.3645 3.3735 3.8224 1.9222 4.1751 2.0297 1.2715 1.8772 1.3499 1.3761 1.3058 1.1768 1.1318 1.2578 1.1933 1.1457 1.1715 1.2794 1.2942 1.2544 1.2695 1.2431 1.2501 1.0514 1.0505 1.0797 1.0864 1.0898 1.0779 1.0838 1.0816 1.0829 1.0653 1.0650 1.0596 1.0616 1.0634 1.0639 1.0248 1.0970 1.0588 1.1014 1.1009 1.0992 1.1017 1.1039 1.1114 1.1079 1.1078 1.0753
irintensity: 0.7369 1.7243 1.5206 9.0566 6.4142 0.0822 0.7530 1.3041 1.5061 1.4903 1.5020 3.4215 2.5955 4.1153 4.3086 1.4464 6.3532 27.7817 3.1190 8.0010 3.0504 2.8967 21.7339 9.5561 22.8982 27.6575 10.4085 61.8059 6.9400 55.7577 27.1940 7.9198 102.1583 62.8502 67.5880 31.9411 90.8001 71.0726 34.6841 45.2010 71.3877 47.8151 49.0076 60.7415 109.5616 32.6547 11.8981 17.9631 4.5015 71.2024 31.3641 69.0815 83.2798 22.4918 27.2225 14.6545 116.9937 29.8080 16.4695 40.4756 7.2164 37.6051 5.6512 7.8736 10.1274 12.9641 9.5680 4.4558 7.6677 5.1526 2.0716 4.9946 5.0514 0.8181 30.6253 13.1966 13.6369 11.3751 7.6470 3.8428 10.5040 22.2685 2.6717 16.7564 37.8766 47.7084 4.6876 28.4432 25.8560 19.1529 0.3724 9.9232 17.5472 18.0730 45.1577 5.9678 20.1572 10.3319 21.1039 0.2364 0.0324 21.7029
temp: 298.150 k
press: 1.00000 atm
elementType: 17 16 15 8 8 8 8 8 7 7 6 6 6 6 6 6 6 6 1 1 1 1 1 1 1 1 1 1 1 1 1 1 1 1 1 1
symmnumber: 1
zpe: 724531.7 jmol-1
zpe.correction: 0.275960 hartree
zpe.thermalcorrener: 0.298315 hartree
zpe.thermalcorrenthalpy: 0.299259 hartree
zpe.thermalcorrgfe: 0.219826 hartree
zpe.sumelectzpe: -1998.954518 hartree
zpe.sumelectthermal: -1998.932162 hartree
zpe.sumelectthermalent: -1998.931218 hartree
zpe.sumelectthermalfe: -1999.010651 hartree
dipole: -2.1425 -1.8400 3.1651
dipole: 4.2419
quadrupole: -97.9998 -149.1314 -139.1160
quadrupole: -7.1418 11.3333 -12.2176
quadrupole: 30.7493 -20.3824 -10.3669 -7.1418 11.3333 -12.2176
hfenergy: -1999.2304775 hartree
pointgroup: C01 [X(C8H18Cl1N2O5P1S1)]
dipole: -0.4129135 -1.5568264 0.4370013 debye
polarizability: 196.3866498|7.4633003|169.470894|1.5116223|11.1810574|157.5925924 unknown
InChI: InChI=1S/C8H18ClN2O5PS/c1-18(13,14)16-8-6-11-5-2-7-15-17(11,12)10-4-3-9/h10H,2-8H2,1H3
charge 0 multiplicity 1
36 atoms
Cl 3.760216 3.581861 2.841667
S  -3.918371 -0.639636 0.763772
P  1.792422 0.145189 -1.014096
O  2.422439 -1.475029 -1.254354
O  1.225791 0.792898 -2.351895
O  -3.056105 -0.175751 -0.84724
O  -4.010146 0.635342 1.755256
O  -3.247481 -2.021766 1.295349
N  0.591689 0.016067 0.231937
N  3.170025 0.858765 -0.212196
C  0.820901 -0.973803 1.324706
C  1.273466 -2.361139 0.802057
C  -0.778676 0.499576 -0.038614
C  2.580442 -2.288577 -0.009982
C  -1.622684 -0.537934 -0.816922
C  3.085708 2.12832 0.538758
C  3.823448 1.958991 1.874493
C  -5.602141 -0.958133 -0.044158
H  1.583207 -0.577318 2.025993
H  -0.125177 -1.072831 1.885874
H  0.476889 -2.803758 0.176147
H  1.434571 -3.03553 1.66607
H  -0.725789 1.435262 -0.620284
H  -1.257205 0.732955 0.931538
H  2.886904 -3.279646 -0.381918
H  3.397003 -1.854146 0.60209
H  4.073291 0.653306 -0.650414
H  -1.506808 -1.553196 -0.388194
H  -1.336825 -0.558022 -1.884503
H  3.513117 2.977476 -0.028255
H  2.02291 2.356164 0.73149
H  3.347283 1.199928 2.511551
H  4.893254 1.737082 1.739325
H  -5.859186 -0.029295 -0.570079
H  -6.296135 -1.187291 0.776154
H  -5.453648 -1.801083 -0.730421
