program: Gaussian 09
title: 000211623
version: EM64L-G09RevD.01
frameworkgroup: C1[X(C18H23N3O2)]
method: RPBEPBE
basis: SDD
operation: Freq
keyword: #p
keyword: freq=noraman
keyword: PBEPBE/SDD
title: #p freq=noraman PBEPBE/SDD
converged: YES YES NO NO
title: Mulliken charges:
elementType: O O N N N C C C C C C C C C C C C C C C C C C H H H H H H H H H H H H H H H H H H H H H H H
charge: -0.278132 -0.323949 -0.110528 -0.457017 -0.080972 -0.371466 -0.337085 -0.328251 -0.305655 -0.668273 -0.670698 0.031384 0.238457 0.091860 -0.246387 0.426521 -0.208835 -0.453320 -0.333085 -0.318470 -0.199192 -0.218982 -0.258572 0.218039 0.235693 0.193241 0.226574 0.208284 0.192219 0.234492 0.242160 0.206911 0.225480 0.209408 0.208051 0.228108 0.209041 0.370804 0.278671 0.234343 0.232377 0.315113 0.241162 0.223418 0.221207 0.225855
chargesum: 0.00000
title: Mulliken charges with hydrogens summed into heavy atoms:
elementType: O O N N N C C C C C C C C C C C C C C C C C C
charge: -0.278132 -0.323949 -0.110528 -0.086212 -0.080972 0.082265 0.082729 0.072251 0.170996 -0.026474 -0.025497 0.031384 0.238457 0.091860 0.032284 0.426521 0.025508 -0.220943 -0.017972 -0.077309 0.024225 0.002225 -0.032716
polarizability: 3.33739730e+02 -3.19735453e+01 2.94346382e+02 1.74498565e+01 5.01452678e+00 1.23009108e+02
1716.lowfreq: -7.2457 -3.4104 -0.0006 -0.0005 -0.0003 0.7042 12.7189 21.0334 27.5670
frequency: 12.1166 20.9759 27.5571 43.8331 49.8405 59.4425 70.8514 81.3986 92.5354 103.7987 129.1615 147.7814 181.6625 198.9728 217.0767 221.1972 256.7050 270.2466 285.2565 289.9000 299.4146 323.8874 377.3132 388.7952 409.5771 412.3847 437.9543 451.9914 478.6363 507.2773 519.7963 530.3986 574.1960 615.1566 645.6703 679.0484 689.9710 698.7046 744.8823 758.5553 763.7664 768.7053 794.5134 795.0551 805.7345 806.6123 810.9266 841.2401 878.8828 888.0902 913.1048 920.0259 923.8369 953.7774 974.9023 983.1333 984.6119 988.8547 1004.2692 1016.3286 1026.7403 1052.4527 1059.5131 1067.4206 1076.3001 1079.0796 1085.8700 1086.0757 1124.7110 1125.1861 1169.3426 1179.5347 1184.9268 1188.1976 1208.1598 1238.8020 1247.6503 1268.7315 1279.7606 1290.1628 1297.4978 1319.3142 1325.3823 1337.8193 1355.1481 1362.2947 1368.5663 1379.3747 1383.6391 1388.9899 1389.7592 1411.7063 1432.5635 1442.8072 1449.8247 1462.5293 1464.4085 1472.1300 1480.7088 1482.8339 1484.8391 1488.2329 1491.7703 1507.5110 1557.2948 1578.7800 1596.6390 1616.0328 1642.1274 2861.6249 2870.6754 2918.5888 2981.0397 2983.4859 3027.4495 3034.0833 3043.3388 3055.4412 3073.5162 3076.1547 3090.5006 3091.2875 3115.8474 3123.0959 3128.2878 3130.7316 3141.5373 3162.5673 3166.1131 3186.2634 3197.0725 3254.2358
redmass: 4.1870 3.4060 4.5814 4.1632 3.7444 4.2635 2.5735 2.2543 4.6144 4.2548 5.9196 2.1090 2.2739 3.2214 2.0360 2.2644 2.7317 2.0212 4.7110 3.5019 2.3767 3.6405 4.5609 3.5880 2.9758 4.1014 4.6448 2.9338 4.0571 3.0593 4.5110 3.0278 7.3980 6.4400 6.5548 5.4979 6.3433 2.0353 2.5810 2.6288 2.0387 2.1326 1.1427 1.2781 2.4261 1.7692 2.3255 1.2965 6.5598 1.1809 2.6980 3.3601 1.4299 1.4149 1.3400 1.3677 6.2051 2.2420 1.3011 5.4816 2.1929 2.9681 2.2553 1.9593 2.6360 2.0386 2.0933 1.5672 1.9651 1.7479 1.0615 1.6563 1.3190 1.4347 2.2454 2.7800 1.4419 2.2557 1.1671 1.2074 1.2103 1.4246 1.4703 3.4824 2.2052 1.3649 1.3422 2.5450 1.6779 1.2409 1.2508 3.0660 2.2089 2.0035 1.3996 1.0526 1.0573 1.0538 1.0513 2.1468 1.1283 1.0702 1.0790 4.5490 7.2315 4.8918 6.7680 6.3429 1.8150 1.0719 1.0713 1.0696 1.0359 1.0357 1.0882 1.0879 1.0612 1.0882 1.0983 1.0982 1.1003 1.1003 1.0873 1.0903 1.0873 1.1084 1.0939 1.1001 1.0901 1.0990 1.0946 1.0802
irintensity: 0.2519 0.0814 0.2301 0.1090 0.7223 1.4576 0.2045 0.3351 0.4553 0.5584 1.4135 1.4599 1.1409 1.4697 0.2825 2.6346 8.7891 1.6093 0.3581 1.1919 2.4331 14.0277 10.3257 5.8356 0.2032 3.0086 3.5138 12.8689 6.1148 3.4325 10.8119 21.6019 5.5748 2.9387 13.2104 13.4834 19.0315 29.1287 4.4762 4.7547 78.2492 0.3508 4.4004 8.8048 5.3417 34.8071 4.4276 10.2473 26.0906 64.5983 2.4533 21.6287 31.5783 0.0753 0.3140 0.6017 1.3816 4.0913 3.2695 159.9311 42.8672 12.6169 53.1132 97.4248 14.8578 34.3846 2.3580 15.7733 166.9498 26.9979 0.1440 13.7747 42.0721 56.8408 39.0729 47.6462 46.1025 438.7321 19.6635 10.8015 19.8983 0.9558 37.5084 13.4864 11.2181 8.8694 8.2085 33.2992 24.0573 21.5531 19.0188 209.9118 49.8317 51.3565 6.0470 6.0801 1.3023 1.3724 4.1892 56.2050 31.4861 11.6461 12.9655 187.7160 118.8779 241.2682 447.2379 29.2890 184.3300 40.8113 141.2600 69.8978 31.0476 32.1651 8.8691 17.5664 31.2701 19.7527 49.6832 71.1568 33.7602 47.5265 9.6430 24.5302 2.1222 14.6263 32.3553 35.9978 6.6046 12.4735 13.2072 181.2013
temp: 298.150 k
press: 1.00000 atm
elementType: 8 8 7 7 7 6 6 6 6 6 6 6 6 6 6 6 6 6 6 6 6 6 6 1 1 1 1 1 1 1 1 1 1 1 1 1 1 1 1 1 1 1 1 1 1 1
symmnumber: 1
zpe: 997939.0 jmol-1
zpe.correction: 0.380095 hartree
zpe.thermalcorrener: 0.402771 hartree
zpe.thermalcorrenthalpy: 0.403715 hartree
zpe.thermalcorrgfe: 0.324472 hartree
zpe.sumelectzpe: -1012.712574 hartree
zpe.sumelectthermal: -1012.689899 hartree
zpe.sumelectthermalent: -1012.688955 hartree
zpe.sumelectthermalfe: -1012.768197 hartree
dipole: -2.9060 0.9613 0.6866
dipole: 3.1369
quadrupole: -129.2832 -121.6079 -142.0838
quadrupole: 2.4562 -2.1527 0.4387
quadrupole: 1.7084 9.3837 -11.0921 2.4562 -2.1527 0.4387
hfenergy: -1013.0926693 hartree
pointgroup: C01 [X(C18H23N3O2)]
dipole: -1.1625758 0.3751838 0.1755704 debye
polarizability: 334.7964315|-26.174789|288.6825037|28.0481234|-24.5087078|127.6162849 unknown
InChI: InChI=1S/C18H23N3O2/c1-3-21(4-2)13-14-23-18(22)16-11-8-12-19-17(16)20-15-9-6-5-7-10-15/h5-12,20H,3-4,13-14H2,1-2H3
charge 0 multiplicity 1
46 atoms
O  -1.977431 1.312535 -0.985938
O  -0.655601 -0.547591 -0.519873
N  -4.896504 -0.810545 0.162008
N  1.958217 -0.109104 -0.069436
N  2.743395 2.137149 -0.173423
C  -3.801154 0.177528 0.29522
C  -4.418276 -2.216386 0.290641
C  -6.090672 -0.507801 0.99342
C  -3.161639 0.404527 -1.088338
C  -5.290454 -3.221982 -0.484175
C  -6.920705 0.667729 0.443896
C  0.354738 1.671679 -0.579022
C  -0.760288 0.712641 -0.680098
C  1.708903 1.23273 -0.269481
C  0.134462 3.056947 -0.781908
C  3.154799 -0.806679 0.243275
C  1.200143 3.96954 -0.683583
C  3.031617 -2.220068 0.381136
C  4.428585 -0.200045 0.42155
C  2.481762 3.451135 -0.375823
C  4.155475 -3.009721 0.690307
C  5.545005 -1.006864 0.731341
C  5.424285 -2.40849 0.868516
H  -4.204444 1.13567 0.667131
H  -3.01793 -0.152557 1.015472
H  -4.351902 -2.520825 1.36532
H  -3.38656 -2.259088 -0.10558
H  -6.726851 -1.411408 1.003599
H  -5.808481 -0.308206 2.05802
H  -2.840243 -0.551951 -1.533879
H  -3.853605 0.929209 -1.763528
H  -6.333321 -3.232534 -0.118487
H  -5.309916 -2.962509 -1.557012
H  -4.887277 -4.245978 -0.37388
H  -6.3375 1.606459 0.41491
H  -7.259755 0.445631 -0.5829
H  -7.807432 0.846105 1.080443
H  1.104222 -0.690052 -0.171397
H  -0.879517 3.39139 -1.016189
H  1.054459 5.041686 -0.83711
H  2.050839 -2.692948 0.24392
H  4.515286 0.881317 0.31389
H  3.346449 4.120059 -0.285985
H  4.040475 -4.094728 0.791765
H  6.522016 -0.528357 0.866325
H  6.299228 -3.021948 1.10894
