program: Gaussian 09
title: 000211621
version: EM64L-G09RevD.01
frameworkgroup: C1[X(C11H15N3O2)]
method: RPBEPBE
basis: SDD
operation: Freq
keyword: #p
keyword: freq=noraman
keyword: PBEPBE/SDD
title: #p freq=noraman PBEPBE/SDD
converged: YES YES NO NO
title: Mulliken charges:
elementType: O O N N N C C C C C C C C C C C H H H H H H H H H H H H H H H
charge: -0.270688 -0.295600 -0.117428 -0.637116 -0.630641 -0.458102 -0.296028 -0.308190 0.258223 0.199077 0.426374 -0.603706 -0.350992 -0.356500 -0.618219 0.228461 0.228283 0.247020 0.230378 0.217727 0.214744 0.222993 0.261961 0.246499 0.259756 0.201329 0.241475 0.321243 0.290465 0.299574 0.347629
chargesum: 0.00000
title: Mulliken charges with hydrogens summed into heavy atoms:
elementType: O O N N N C C C C C C C C C C C
charge: -0.270688 -0.295600 -0.117428 -0.025408 0.016562 0.017201 0.152077 0.129547 0.258223 0.199077 0.426374 -0.341746 -0.104493 -0.096744 -0.175415 0.228461
polarizability: 2.04136661e+02 9.26114569e+00 1.29171842e+02 -7.30978705e+00 3.60070474e-01 1.11025617e+02
1716.lowfreq: -2.5782 -0.0003 0.0002 0.0005 5.0505 10.1289 23.9761 45.5286 62.0387
frequency: 23.9025 45.5040 62.0376 67.0022 97.9216 154.5461 179.2827 201.3724 228.5588 259.9174 277.7600 298.4594 330.6129 350.0604 393.3339 408.7029 417.1526 455.1174 469.9208 508.5831 521.4073 545.8018 566.2638 585.4804 605.9788 650.1586 686.3394 691.6213 721.3435 737.9289 801.3390 824.0644 840.5922 860.0833 876.7851 885.5435 937.1920 951.3581 958.1246 993.6471 1011.9178 1032.6291 1034.5323 1066.8501 1087.3105 1098.3793 1141.2025 1169.2750 1176.3916 1205.5548 1224.5209 1235.1340 1244.1019 1254.1480 1265.2095 1322.4221 1341.2460 1355.1765 1361.3027 1380.0835 1404.7567 1416.0378 1453.5945 1465.3535 1469.7982 1471.4912 1485.4352 1573.9356 1601.2829 1609.4643 1629.0486 1664.7009 2909.3820 2979.4964 3000.5461 3003.1460 3013.8601 3052.4395 3081.9493 3094.4357 3129.1798 3143.5646 3165.6507 3520.8661 3532.1201 3655.7589 3680.9423
redmass: 4.5112 4.8268 3.1994 3.6811 3.1993 3.1148 2.4720 5.0307 2.3662 3.0090 2.4512 1.7747 4.5379 3.9732 2.6674 1.5063 4.8516 2.1635 3.0096 1.4669 2.4114 1.2705 3.4313 3.3815 4.3353 4.4405 6.5709 5.4711 4.2110 4.4628 2.2189 1.7214 2.3177 2.9661 1.6038 2.4514 2.8169 2.4896 1.4566 2.2417 1.9973 1.6340 2.2112 2.2716 2.9476 2.2763 1.5631 1.7150 1.7425 1.1593 1.2712 1.5269 2.3005 1.6482 1.3196 1.3085 1.4135 1.2376 2.0274 2.4016 2.9052 4.0966 1.0785 1.2745 1.0955 1.1046 2.1975 7.6215 1.2983 6.4695 1.4648 2.3227 1.0700 1.0638 1.0629 1.0897 1.0638 1.0993 1.1010 1.1038 1.0908 1.0876 1.0969 1.0454 1.0451 1.1020 1.1023
irintensity: 1.8434 5.0198 6.5516 1.6695 2.1991 9.2718 22.5843 6.6890 16.8302 6.3243 1.5494 54.6450 5.8121 4.2020 9.4926 57.2000 3.5449 0.9189 2.8084 206.2220 106.1125 191.9213 8.1751 13.9961 18.5669 20.9223 64.8328 4.5348 1.9182 11.7746 8.5386 47.2719 6.0491 12.8126 15.5679 5.1322 26.9509 25.7876 2.8287 2.1431 20.3931 14.6899 74.1435 6.9520 33.4701 8.4348 10.5971 2.2253 30.8414 15.0745 8.0174 21.7288 137.8083 89.5293 13.8404 13.2350 5.4922 1.0508 65.6977 4.4344 41.9688 126.9719 18.5758 49.7425 12.6469 8.1064 110.2990 24.4232 85.1508 25.1137 160.9177 427.5286 69.7548 61.0299 43.7226 24.5293 50.8697 10.2530 56.0280 28.1398 5.5675 3.8210 5.8461 39.1819 20.8831 42.3649 22.9863
temp: 298.150 k
press: 1.00000 atm
elementType: 8 8 7 7 7 6 6 6 6 6 6 6 6 6 6 6 1 1 1 1 1 1 1 1 1 1 1 1 1 1 1
symmnumber: 1
zpe: 662051.9 jmol-1
zpe.correction: 0.252162 hartree
zpe.thermalcorrener: 0.267579 hartree
zpe.thermalcorrenthalpy: 0.268523 hartree
zpe.thermalcorrgfe: 0.208728 hartree
zpe.sumelectzpe: -741.639069 hartree
zpe.sumelectthermal: -741.623652 hartree
zpe.sumelectthermalent: -741.622708 hartree
zpe.sumelectthermalfe: -741.682503 hartree
dipole: -2.2476 -0.3356 1.8303
dipole: 2.9179
quadrupole: -69.7547 -95.9386 -92.5965
quadrupole: 1.5571 13.6545 -2.1675
quadrupole: 16.3419 -9.8420 -6.4999 1.5571 13.6545 -2.1675
hfenergy: -741.8912308 hartree
pointgroup: C01 [X(C11H15N3O2)]
dipole: 0.7746465 0.6715875 0.5165219 debye
polarizability: 198.7436372|23.4992539|127.060796|4.567554|-7.8603705|118.5296865 unknown
InChI: InChI=1S/C11H15N3O2/c12-11(13)14-7-8-2-3-9-10(6-8)16-5-1-4-15-9/h2-3,6H,1,4-5,7,12-13H2
charge 0 multiplicity 1
31 atoms
O  1.830672 1.807644 -0.739311
O  2.47485 -0.131755 1.49233
N  -3.580077 -1.000186 -0.904632
N  -5.115966 -0.635382 0.820844
N  -3.478165 1.019115 0.465357
C  4.02406 0.662785 -0.326765
C  3.200978 1.953946 -0.183568
C  3.805673 -0.295417 0.869736
C  1.045447 0.696966 -0.383005
C  1.351748 -0.25974 0.626548
C  -1.075884 -0.483442 -0.849462
C  -0.165648 0.566771 -1.107474
C  0.443368 -1.310594 0.883272
C  -0.761533 -1.427485 0.162701
C  -2.3714 -0.607866 -1.66435
C  -4.00561 -0.221122 0.067964
H  5.10088 0.910511 -0.395937
H  3.745982 0.182192 -1.282986
H  3.134949 2.279976 0.870831
H  3.624688 2.767177 -0.794612
H  3.947977 -1.351807 0.565247
H  4.499176 -0.065912 1.696276
H  -0.372129 1.313058 -1.884235
H  0.701101 -2.017565 1.679161
H  -1.469493 -2.232328 0.383507
H  -2.530424 0.344168 -2.222377
H  -2.229166 -1.390613 -2.434191
H  -5.527031 -1.516116 0.516396
H  -5.731814 0.056782 1.243827
H  -3.688886 1.374286 1.397261
H  -2.584918 1.306355 0.068349
