program: Gaussian 09
title: 000211617
version: EM64L-G09RevD.01
frameworkgroup: C1[X(C14H23NOS)]
method: RPBEPBE
basis: SDD
operation: Freq
keyword: #p
keyword: freq=noraman
keyword: PBEPBE/SDD
title: #p freq=noraman PBEPBE/SDD
converged: YES YES NO NO
title: Mulliken charges:
elementType: S O N C C C C C C C C C C C C C C H H H H H H H H H H H H H H H H H H H H H H H
charge: -0.032738 -0.296340 -0.285442 -0.371760 -0.393740 -0.376294 -0.264681 0.026996 -0.285149 0.329285 0.330636 -0.708928 -0.388279 -0.391481 -0.812703 -0.812066 -0.236179 0.179084 0.216075 0.208614 0.208871 0.212999 0.184565 0.193617 0.197066 0.241279 0.208573 0.207853 0.276273 0.252630 0.231748 0.231679 0.253524 0.224159 0.223745 0.223941 0.253376 0.222396 0.223056 0.093742
chargesum: 0.00000
title: Mulliken charges with hydrogens summed into heavy atoms:
elementType: S O N C C C C C C C C C C C C C C
charge: 0.061004 -0.296340 -0.044163 0.023399 0.023745 0.021269 0.126002 0.026996 0.131276 0.329285 0.330636 -0.180025 -0.156531 -0.159803 -0.111274 -0.112352 -0.013124
polarizability: 2.45502398e+02 -3.26326513e-01 1.72779112e+02 -1.98124138e+01 4.60817641e+00 1.22242921e+02
1716.lowfreq: -0.0007 0.0003 0.0008 2.4283 5.1047 13.1026 17.9124 29.0900 36.3988
frequency: 17.4879 29.0870 36.0530 40.8762 62.4116 66.5176 83.1918 99.4226 109.3316 116.6915 123.7619 138.8268 140.7487 165.7156 186.4192 211.5394 220.9172 267.1879 275.9751 308.6198 331.1886 351.8040 441.8343 461.8579 466.0001 509.6395 526.4563 539.1728 565.8838 666.1162 679.5368 684.9443 743.7670 751.6170 755.0035 778.7873 804.9715 805.5445 843.2934 897.5005 917.9434 926.6699 945.8445 972.1775 980.8662 996.1401 1027.7286 1033.0301 1044.4948 1047.3868 1049.1554 1065.8593 1072.4001 1088.6562 1109.0885 1129.2474 1141.7156 1153.2923 1164.4762 1175.4967 1206.4346 1240.9367 1247.1007 1257.5611 1266.7468 1272.0950 1277.0900 1280.6816 1287.3268 1319.7447 1347.8670 1366.8093 1376.5587 1389.2192 1393.0118 1394.4225 1432.6631 1448.2840 1455.6673 1455.8600 1463.9748 1466.6431 1470.2040 1473.7146 1483.4808 1485.1588 1487.0564 1494.0062 1498.2994 1598.1194 1603.1959 2429.9564 2858.2684 2893.0212 2946.1776 2960.3559 2974.2058 2975.0248 2991.4513 2995.8342 2999.0994 3008.4737 3028.6067 3031.7250 3056.6306 3057.0136 3061.1219 3097.1747 3097.6514 3110.7845 3116.8332 3125.7500 3153.6996 3421.4483
redmass: 4.8951 5.7977 3.6280 1.9839 1.7920 4.4677 2.7967 1.3286 1.1712 1.9031 2.0373 3.0555 3.0579 2.4891 3.3165 1.2458 3.0100 3.4760 3.3633 3.9850 4.1128 3.8896 3.6249 4.2962 3.4378 3.0726 4.5675 5.5288 3.5198 5.0963 1.3055 2.8908 1.2555 1.0727 4.5429 1.2391 4.9329 1.1563 1.1544 1.3127 2.5586 1.2279 7.6182 1.3469 1.5841 2.7113 4.3129 1.7829 1.5792 1.5219 1.8908 3.0028 2.1748 1.7857 2.7158 1.3758 4.0948 1.2022 4.4560 1.1588 1.4390 1.2376 1.2447 1.5952 1.2790 3.0199 1.1305 1.1006 1.1237 1.2764 1.3857 7.3453 1.5043 1.4654 1.2432 1.2573 2.1586 1.1109 1.1709 2.1205 1.0579 1.0714 1.0763 1.1155 1.1425 1.1892 1.1268 1.0954 1.0874 5.6859 7.4321 1.0383 1.0710 1.0696 1.0555 1.0644 1.0410 1.0407 1.0622 1.1053 1.0824 1.0892 1.0989 1.0599 1.0920 1.0919 1.1042 1.1001 1.0999 1.1059 1.0856 1.0919 1.0991 1.0740
irintensity: 0.2479 0.2130 0.3862 0.2000 2.3193 0.9146 1.2401 3.0853 0.7105 2.2405 0.1210 2.4801 3.2766 2.3845 5.2913 21.4186 0.0007 10.7144 3.0463 8.3919 4.6482 1.0520 6.4420 1.1521 0.8050 0.2849 2.2980 0.0665 2.1229 4.5314 91.1296 20.0279 7.0229 7.6178 2.8160 53.6308 12.0007 0.6746 8.9976 0.1678 2.1645 1.1300 85.2233 1.4953 4.5833 2.5499 2.9662 6.9528 8.4714 3.1332 6.7336 2.0954 24.3325 57.6861 1.4018 15.9915 101.2442 8.8504 125.4923 1.3892 3.2053 4.4248 1.5333 1.4923 4.0439 19.6125 1.2786 0.4529 0.8529 2.9440 14.8835 0.1631 25.4003 4.0846 19.5788 5.4265 14.7998 12.5700 30.6489 0.9615 1.1289 29.0496 2.8443 5.8636 25.7030 17.2504 8.0533 21.3094 15.6881 2.8731 2.5975 30.2044 91.2531 87.7004 29.4180 29.0580 44.4055 14.7038 21.1054 33.9596 36.9224 22.2252 7.2558 26.6858 17.8178 43.0921 76.8284 7.5451 18.1444 17.1586 0.2811 27.4712 35.7313 1.5170
temp: 298.150 k
press: 1.00000 atm
elementType: 16 8 7 6 6 6 6 6 6 6 6 6 6 6 6 6 6 1 1 1 1 1 1 1 1 1 1 1 1 1 1 1 1 1 1 1 1 1 1 1
symmnumber: 1
zpe: 891084.0 jmol-1
zpe.correction: 0.339396 hartree
zpe.thermalcorrener: 0.360081 hartree
zpe.thermalcorrenthalpy: 0.361026 hartree
zpe.thermalcorrgfe: 0.286444 hartree
zpe.sumelectzpe: -1073.961585 hartree
zpe.sumelectthermal: -1073.940899 hartree
zpe.sumelectthermalent: -1073.939955 hartree
zpe.sumelectthermalfe: -1074.014537 hartree
dipole: 0.9707 -0.0684 -0.8444
dipole: 1.2884
quadrupole: -135.8948 -103.5895 -115.7374
quadrupole: -3.3663 -8.0893 3.3472
quadrupole: -17.4876 14.8177 2.6699 -3.3663 -8.0893 3.3472
hfenergy: -1074.3009805 hartree
pointgroup: C01 [X(C14H23N1O1S1)]
dipole: 0.3820138 -0.0377079 -0.3310494 debye
polarizability: 245.5255322|-1.2082357|173.0014911|-19.6778519|3.3243003|121.9974077 unknown
InChI: InChI=1S/C14H23NOS/c1-12-6-5-7-13(2)14(12)16-10-4-3-8-15-9-11-17/h5-7,15,17H,3-4,8-11H2,1-2H3
charge 0 multiplicity 1
40 atoms
S  -8.738242 0.102102 -0.061633
O  1.570696 0.016613 0.848831
N  -4.569394 -0.117058 -0.404284
C  -2.084294 -0.068262 -0.274693
C  -0.848402 -0.033834 0.652431
C  -3.408727 -0.073784 0.513496
C  0.463193 -0.021752 -0.135592
C  2.874991 0.018217 0.271129
C  -5.894044 -0.074207 0.252531
C  3.501881 1.264602 -0.003907
C  3.531036 -1.225656 0.059047
C  -6.993699 0.114539 -0.805862
C  4.822043 1.244021 -0.51868
C  4.850469 -1.200769 -0.456866
C  2.780702 2.573914 0.259252
C  2.839583 -2.535628 0.390042
C  5.491541 0.022687 -0.751274
H  -2.038495 -0.972368 -0.919195
H  -2.084552 0.805806 -0.954356
H  -0.849117 -0.911951 1.32687
H  -0.881789 0.865092 1.298075
H  -3.482799 0.856017 1.111998
H  -3.399191 -0.923449 1.242849
H  0.559586 -0.930908 -0.766296
H  0.524014 0.867918 -0.797359
H  -4.498608 -0.913709 -1.054233
H  -5.900209 0.790139 0.945725
H  -6.125763 -0.978482 0.865942
H  -6.840823 1.049512 -1.366896
H  -7.00727 -0.725083 -1.523159
H  5.326305 2.194837 -0.730042
H  5.376867 -2.149052 -0.620056
H  2.090565 2.475421 1.114037
H  3.499242 3.384781 0.470297
H  2.17868 2.888589 -0.61614
H  3.577165 -3.326268 0.611523
H  2.170454 -2.415972 1.258881
H  2.219119 -2.892683 -0.45576
H  6.513998 0.024616 -1.145238
H  -8.599806 1.277548 0.659864
