program: Gaussian 09
title: 000015236
version: EM64L-G09RevD.01
frameworkgroup: C1[X(C17H13NS)]
method: RPBEPBE
basis: SDD
operation: Freq
keyword: #p
keyword: freq=noraman
keyword: PBEPBE/SDD
title: #p freq=noraman PBEPBE/SDD
converged: YES YES NO NO
title: Mulliken charges:
elementType: S N C C C C C C C C C C C C C C C C C H H H H H H H H H H H H H
charge: 0.208916 -0.061058 0.265692 -0.067347 0.211952 -0.885395 0.280559 0.453538 -0.091586 -0.408327 -0.814892 -0.378258 -0.356412 -0.326260 -0.263105 -0.259797 -0.249657 -0.233612 -0.234980 0.256980 0.293497 0.243217 0.225138 0.242274 0.241357 0.277169 0.264494 0.244997 0.227743 0.229941 0.232591 0.230632
chargesum: 0.00000
title: Mulliken charges with hydrogens summed into heavy atoms:
elementType: S N C C C C C C C C C C C C C C C C C
charge: 0.208916 -0.061058 0.265692 -0.067347 0.211952 -0.334918 0.280559 0.453538 -0.091586 -0.408327 -0.104263 -0.136901 -0.079243 -0.061766 -0.018108 -0.032054 -0.019716 -0.001021 -0.004348
polarizability: 3.48385605e+02 -1.64380778e+00 2.26707200e+02 -7.94926570e-01 -2.82834494e+00 9.37592128e+01
1716.lowfreq: -6.9859 -3.9608 -3.0598 0.0013 0.0014 0.0021 45.3566 57.1625 102.0557
frequency: 45.3453 57.1467 102.0521 114.7496 131.6249 147.5766 191.0010 210.3768 285.3223 298.2743 307.0891 325.7801 342.0984 381.5187 427.3922 433.8950 452.7746 485.0566 492.2397 512.4721 546.3540 572.5335 578.1254 586.1106 644.1858 671.9948 687.3181 700.8693 728.6910 746.5848 768.1283 774.5208 794.8944 805.8684 855.9059 877.6696 878.7989 897.5533 933.8163 961.2565 963.9626 990.9477 994.7038 1020.6096 1029.9254 1033.9719 1035.3523 1062.8472 1078.6723 1120.3651 1135.7845 1158.1915 1171.1798 1181.3784 1192.3122 1244.4677 1253.6588 1254.7659 1300.9921 1310.6800 1356.7046 1372.8055 1390.7438 1398.5344 1416.7640 1428.7461 1439.0834 1442.6912 1462.3700 1472.4824 1476.4382 1497.8339 1545.7590 1568.9688 1576.7122 1598.5865 1618.1404 2986.4531 3020.3098 3058.1387 3113.4244 3126.7023 3129.8050 3130.1755 3143.0481 3143.9747 3157.9746 3158.7503 3170.7611 3171.4562
redmass: 4.7586 4.4102 1.8035 4.3610 1.5805 3.7084 5.3287 4.5672 6.1116 3.9386 4.0455 3.8120 4.4528 5.3581 5.2393 4.0514 3.6908 4.4680 5.0669 4.3433 3.6824 4.3947 6.2992 4.1855 6.3618 5.2706 5.9698 7.1374 4.8502 2.0697 1.4066 1.7083 4.1244 3.1766 4.5521 1.4048 1.6377 2.3611 2.9894 1.3946 1.3640 1.3448 1.3255 2.3294 4.0599 1.7905 2.6192 2.0288 2.2515 1.8047 1.5161 1.3994 1.0635 1.2456 1.8521 1.5835 1.3469 2.0025 2.3554 3.5422 4.6581 8.2632 3.3889 1.2726 4.1952 2.5350 1.4758 1.8099 2.8306 1.1734 1.2074 2.3475 6.8656 6.7787 6.1439 6.4566 6.3546 1.0408 1.0658 1.0968 1.0964 1.0947 1.0855 1.0853 1.0905 1.0891 1.0954 1.0952 1.0999 1.0986
irintensity: 0.8387 1.1246 0.7014 1.9816 0.0417 2.8909 1.8743 0.2505 0.1862 0.8925 1.0722 1.1631 0.7301 0.8838 2.0858 0.4964 9.5717 6.6774 2.2620 0.2060 2.3442 1.8219 5.9971 1.2986 3.0375 2.7651 1.8623 0.9070 3.2269 58.5725 19.1933 98.8784 10.0923 4.8988 0.2560 0.4082 1.2716 0.4779 12.2317 5.0701 2.4898 2.0495 0.2652 8.1848 20.3176 3.8587 9.3293 0.9398 0.0600 0.9234 5.8708 2.8374 5.5270 9.9879 2.0148 6.1211 2.7083 3.8977 4.4547 5.9101 56.6057 0.8507 12.3821 12.8064 10.3809 37.3229 7.9799 9.3306 12.9943 29.0870 20.5931 20.9523 21.5476 12.7575 45.3508 7.9729 3.3578 21.3438 19.5656 12.9634 13.5645 16.9025 0.5733 1.3325 10.1434 8.8860 23.9754 24.4544 32.4684 22.9454
temp: 298.150 k
press: 1.00000 atm
elementType: 16 7 6 6 6 6 6 6 6 6 6 6 6 6 6 6 6 6 6 1 1 1 1 1 1 1 1 1 1 1 1 1
symmnumber: 1
zpe: 651151.8 jmol-1
zpe.correction: 0.248011 hartree
zpe.thermalcorrener: 0.262888 hartree
zpe.thermalcorrenthalpy: 0.263833 hartree
zpe.thermalcorrgfe: 0.206014 hartree
zpe.sumelectzpe: -1107.152826 hartree
zpe.sumelectthermal: -1107.137948 hartree
zpe.sumelectthermalent: -1107.137004 hartree
zpe.sumelectthermalfe: -1107.194823 hartree
dipole: -1.8006 1.4214 1.1781
dipole: 2.5788
quadrupole: -99.6649 -106.4631 -123.1558
quadrupole: -6.1421 1.0370 1.7841
quadrupole: 10.0964 3.2982 -13.3946 -6.1421 1.0370 1.7841
hfenergy: -1107.4008365 hartree
pointgroup: C01 [X(C17H13N1S1)]
dipole: -0.7268547 -0.5390704 -0.458754 debye
polarizability: 348.2996558|-3.1553875|226.6170742|2.5602393|-5.3540478|93.935287 unknown
InChI: InChI=1S/C17H13NS/c1-11-12-6-2-4-8-15(12)18-17-13-7-3-5-9-16(13)19-10-14(11)17/h2-9H,10H2,1H3
charge 0 multiplicity 1
32 atoms
S  2.389362 -2.304714 0.661146
N  -0.4163 1.137054 -0.018747
C  -0.087091 -1.291461 -0.254988
C  0.406447 0.072796 -0.143482
C  -1.469882 -1.53726 -0.156046
C  0.930561 -2.369335 -0.54652
C  -2.359039 -0.403839 -0.00197
C  1.868038 0.377002 -0.127257
C  -1.780692 0.921077 0.036073
C  2.855031 -0.578447 0.256056
C  -2.079827 -2.925264 -0.229822
C  -3.783696 -0.525939 0.090717
C  2.301255 1.701421 -0.416314
C  -2.631362 2.066404 0.154938
C  4.215393 -0.209404 0.374541
C  -4.595524 0.607052 0.2090
C  3.655067 2.070146 -0.313196
C  -4.016936 1.914399 0.239787
C  4.61677 1.113528 0.094172
H  0.529962 -3.388313 -0.463199
H  1.363494 -2.24202 -1.554728
H  -2.724042 -3.029129 -1.123414
H  -1.328695 -3.72696 -0.270056
H  -2.716361 -3.118261 0.653262
H  -4.249234 -1.516168 0.063562
H  1.53375 2.42932 -0.694509
H  -2.151691 3.04951 0.182843
H  4.955151 -0.960555 0.671358
H  -5.683211 0.494901 0.278298
H  3.96216 3.096005 -0.54266
H  -4.66438 2.793048 0.333404
H  5.673225 1.390507 0.180952
