program: Gaussian 09
title: 000216831
version: EM64L-G09RevD.01
frameworkgroup: C1[X(C9H20NO3PS2)]
method: RPBEPBE
basis: SDD
operation: Freq
keyword: #p
keyword: freq=noraman
keyword: PBEPBE/SDD
title: #p freq=noraman PBEPBE/SDD
converged: YES YES NO NO
title: Mulliken charges:
elementType: S S P O O O N C C C C C C C C C H H H H H H H H H H H H H H H H H H H H
charge: 0.107475 -0.300738 0.603132 -0.477010 -0.459533 -0.269110 -0.343106 0.023966 0.034912 -0.650944 -0.662769 -0.653775 -0.654053 -0.833436 0.324456 -0.602559 0.234181 0.218137 0.212447 0.234162 0.228860 0.211057 0.230375 0.229577 0.205048 0.253451 0.228186 0.206904 0.227667 0.234475 0.314468 0.297391 0.319896 0.227005 0.274498 0.225305
chargesum: 0.00000
title: Mulliken charges with hydrogens summed into heavy atoms:
elementType: S S P O O O N C C C C C C C C C
charge: 0.107475 -0.300738 0.603132 -0.477010 -0.459533 -0.269110 -0.023210 0.258148 0.253049 0.024525 0.008240 0.032911 0.014993 -0.221577 0.324456 0.124248
polarizability: 2.10587317e+02 5.29675655e+00 1.80704217e+02 2.68345416e+00 1.07060105e+01 1.61072267e+02
1716.lowfreq: -5.5020 -0.0035 -0.0029 -0.0024 4.9251 6.4408 13.7332 14.7855 28.6156
frequency: 9.2265 13.8354 28.2267 41.2308 49.1688 59.9458 74.6046 87.4127 93.7306 117.6297 129.5908 137.1038 162.2025 168.0602 181.5797 186.0548 200.3243 222.4528 228.2014 247.8057 261.6678 289.3126 293.6098 326.8247 338.8246 368.9079 404.8832 409.6486 419.3184 452.1138 471.5822 527.6417 539.5474 653.4475 660.0819 672.7625 703.7122 746.3264 816.4490 830.8837 837.4901 892.1422 896.9190 902.4522 927.5477 927.9852 937.0120 937.1381 1067.8598 1089.6682 1096.6356 1118.4692 1141.7247 1152.9051 1154.9380 1155.8045 1178.9171 1181.7112 1251.7587 1279.1062 1320.9908 1326.1411 1334.3458 1335.2878 1380.4132 1381.4504 1395.1630 1396.6583 1413.8004 1418.8016 1450.7495 1453.8034 1461.2570 1462.9950 1464.3002 1466.0255 1469.0269 1483.5377 1485.1533 1486.4400 1535.7104 1630.5904 2975.4878 2988.7270 2988.9213 2989.3307 2992.5687 2993.1089 2993.8716 3011.3128 3055.8484 3085.6573 3086.5783 3092.8053 3093.1481 3098.5153 3101.1354 3104.8444 3108.1229 3109.2615 3117.3453 3417.2835
redmass: 4.5471 2.7526 2.6495 4.6176 3.8671 4.9571 4.4768 2.3741 1.4194 5.4851 6.0103 5.1190 5.3801 6.0551 1.0311 1.0516 3.5868 1.1379 1.2954 5.2963 4.5312 3.3170 3.9239 3.7157 2.6832 3.7247 3.0123 2.8960 3.4122 2.9323 4.0406 11.7826 6.7718 4.9669 4.4527 4.9210 1.1674 5.8235 5.6970 5.5213 2.4874 2.4302 2.8143 2.9437 1.2236 1.2253 1.3282 1.3545 3.0686 1.6090 1.6536 1.3049 1.6203 2.0579 1.6203 1.6158 1.9551 1.9616 1.2172 2.0869 1.2543 1.1723 1.3736 1.4663 1.2513 1.2523 1.2186 1.2120 1.1487 1.1419 1.0498 1.0476 1.0967 1.0480 1.0519 1.0670 1.0492 1.0506 1.0459 1.0507 1.5484 6.6330 1.0356 1.0461 1.0678 1.0363 1.0682 1.0428 1.0522 1.0626 1.1009 1.0988 1.0990 1.0990 1.0990 1.1008 1.1010 1.1007 1.1007 1.0986 1.1019 1.0810
irintensity: 0.0714 0.2272 0.3266 2.9175 1.6613 2.0685 5.3906 0.6775 1.1606 6.2083 0.5219 0.7005 4.3042 2.9462 0.1099 0.1142 8.5363 0.6191 1.7755 2.1488 3.5541 6.1023 3.6143 4.0569 1.6755 10.9479 30.6613 0.2701 9.3961 10.1735 29.1482 66.6614 14.2463 4.8979 80.5144 41.6666 90.7381 2.4942 209.4171 207.0895 32.2619 2.4568 81.7182 55.5186 3.7110 5.2185 0.6256 0.3020 6.8960 90.0293 78.7625 1.0791 27.1295 9.1249 1.4651 22.2237 17.4546 15.3796 2.7389 31.4207 15.3679 19.5299 8.3712 4.4132 19.3188 35.5091 28.7702 24.8626 21.6017 37.7939 7.7270 6.9048 17.0495 1.0994 12.5967 14.5715 10.5952 13.8704 12.8637 10.6468 84.9559 232.7033 58.6818 13.9686 9.0692 14.5540 7.5334 23.9584 23.0037 6.3907 39.5224 4.8575 10.1777 42.6914 38.1342 16.9700 17.9707 30.6812 23.5166 3.0775 1.9030 166.4817
temp: 298.150 k
press: 1.00000 atm
elementType: 16 16 15 8 8 8 7 6 6 6 6 6 6 6 6 6 1 1 1 1 1 1 1 1 1 1 1 1 1 1 1 1 1 1 1 1
symmnumber: 1
zpe: 757897.9 jmol-1
zpe.correction: 0.288668 hartree
zpe.thermalcorrener: 0.311355 hartree
zpe.thermalcorrenthalpy: 0.312299 hartree
zpe.thermalcorrgfe: 0.232561 hartree
zpe.sumelectzpe: -1771.445826 hartree
zpe.sumelectthermal: -1771.423139 hartree
zpe.sumelectthermalent: -1771.422195 hartree
zpe.sumelectthermalfe: -1771.501933 hartree
dipole: 4.5496 1.8254 2.6791
dipole: 5.5865
quadrupole: -124.1944 -107.1084 -129.7708
quadrupole: -9.3286 -9.3088 -1.7178
quadrupole: -3.8365 13.2495 -9.4129 -9.3286 -9.3088 -1.7178
hfenergy: -1771.7344946 hartree
pointgroup: C01 [X(C9H20N1O3P1S2)]
dipole: -1.7352559 0.819319 -1.0715897 debye
polarizability: 209.707097|-7.2711507|181.1351387|2.1017185|-11.2752604|161.5215655 unknown
InChI: InChI=1S/C6H14O2PS.C3H6NOS/c1-5(2)7-9(10)8-6(3)4;1-4-3(5)2-6/h5-6H,1-4H3;4H,2H2,1H3
charge 0 multiplicity 1
36 atoms
S  0.496125 -1.563385 1.418143
S  -0.117624 -0.349766 -2.059697
P  -0.545674 -0.123856 -0.018991
O  -2.235854 -0.189099 0.37473
O  -0.105121 1.364002 0.720935
O  4.043857 -1.596665 1.088604
N  3.13901 -0.392628 -0.703488
C  -3.151201 -1.131508 -0.372078
C  -0.551099 2.674915 0.096809
C  -3.058753 -2.535163 0.239116
C  -4.535995 -0.491077 -0.245863
C  -1.798442 3.161987 0.842255
C  0.661007 3.600172 0.228673
C  1.835555 -2.23504 0.241594
C  3.109928 -1.385308 0.256138
C  4.247436 0.56201 -0.801434
H  -2.818958 -1.142462 -1.430026
H  -0.778807 2.484202 -0.971925
H  -3.751943 -3.216827 -0.287122
H  -2.038125 -2.947098 0.15623
H  -3.335749 -2.509819 1.307456
H  -5.282717 -1.111255 -0.774624
H  -4.543995 0.519928 -0.6870
H  -4.831405 -0.416899 0.815164
H  -2.144044 4.120428 0.411403
H  -2.61269 2.422232 0.766695
H  -1.567928 3.321693 1.909871
H  0.414425 4.602972 -0.166035
H  1.523515 3.201011 -0.331756
H  0.948577 3.701983 1.289413
H  2.061771 -3.23114 0.652502
H  1.381071 -2.327301 -0.761292
H  2.325196 -0.28276 -1.323147
H  4.692352 0.551652 -1.813054
H  5.013229 0.265311 -0.067002
H  3.910075 1.590158 -0.568895
