program: Gaussian 09
title: 000211612
version: EM64L-G09RevD.01
frameworkgroup: C1[X(C15H24N2O)]
method: RPBEPBE
basis: SDD
operation: Freq
keyword: #p
keyword: freq=noraman
keyword: PBEPBE/SDD
title: #p freq=noraman PBEPBE/SDD
converged: YES YES NO NO
title: Mulliken charges:
elementType: O N N C C C C C C C C C C C C C C C H H H H H H H H H H H H H H H H H H H H H H H H
charge: -0.290865 -0.363922 -0.364985 -0.173096 -0.179831 -0.410730 0.473921 0.188435 -0.325281 -0.699657 -0.699914 -0.377973 -0.393586 -0.407140 -0.244110 -0.239987 -0.677380 -0.241422 0.241063 0.236823 0.187437 0.217468 0.335222 0.253722 0.213252 0.181947 0.206847 0.265020 0.212376 0.219425 0.215344 0.217023 0.188115 0.214787 0.270814 0.234638 0.209416 0.211936 0.221408 0.225468 0.221210 0.226765
chargesum: 0.00000
title: Mulliken charges with hydrogens summed into heavy atoms:
elementType: O N N C C C C C C C C C C C C C C C
charge: -0.290865 -0.028701 -0.111263 0.067967 0.056992 -0.005825 0.473921 0.188435 0.069918 -0.015414 -0.048123 0.024929 -0.122772 -0.172502 -0.018643 -0.018777 -0.034619 -0.014657
polarizability: 1.82444078e+02 -2.31534344e+01 1.73856385e+02 3.63322593e+00 6.61361389e+00 1.73126687e+02
1716.lowfreq: -13.4112 -8.0377 -3.0110 -0.0009 -0.0004 0.0006 5.2623 18.5626 32.6166
frequency: -7.0772 18.3790 32.6002 42.4494 48.6807 64.3840 76.8685 97.7421 128.5873 134.2023 143.9601 180.5182 208.3551 218.6693 220.0910 236.9082 265.1393 281.0824 323.8923 330.5133 339.8900 385.0110 401.9580 416.6765 455.1386 511.7118 549.2946 576.2072 616.4662 628.4696 704.4762 710.2610 719.9909 756.8918 764.8484 775.3019 808.4873 824.0325 857.8917 874.4131 887.2056 904.9540 913.2036 920.1135 931.4619 972.3443 980.7146 990.2560 998.3188 1028.4982 1039.4784 1047.8186 1062.6134 1069.4038 1076.3944 1089.7522 1122.5049 1125.3197 1128.5022 1137.7767 1172.2896 1174.1194 1191.8613 1201.5152 1206.8847 1234.1743 1264.9562 1271.5732 1274.7785 1285.1768 1289.4451 1320.3024 1322.5471 1330.0679 1359.7069 1371.7698 1378.4646 1384.0974 1390.7850 1392.9512 1435.9334 1441.0232 1455.0902 1463.9574 1472.5915 1473.4088 1475.8672 1477.7631 1478.7705 1482.3919 1484.0284 1485.6501 1493.8097 1591.7905 1608.0465 1613.1423 2888.4798 2968.1593 2968.4945 2977.3939 2980.2561 2982.0087 2990.5545 3004.3434 3006.8308 3034.0639 3035.1642 3073.5983 3075.5086 3077.2747 3079.0607 3079.7038 3104.6442 3118.8240 3124.9821 3136.9453 3146.4262 3161.2398 3376.9043 3402.2459
redmass: 3.9574 3.7280 3.4183 3.7878 2.5259 2.6089 3.1424 2.4359 3.0491 2.2900 2.3758 3.0187 1.0941 1.3935 1.2331 3.4500 3.6374 2.6585 3.8763 5.2167 3.7873 2.9569 2.8346 2.8625 3.1067 3.8072 3.4664 3.7664 6.3751 4.8805 1.7691 1.4652 3.4778 1.0845 1.9256 1.2983 2.9234 1.3108 1.2485 1.8791 1.3652 1.7677 1.4501 1.9732 1.6362 1.9902 1.3881 5.6169 1.3288 2.2334 2.7820 1.9083 2.5583 2.0164 2.3114 1.7494 2.3294 2.2007 2.0038 2.9070 1.0858 1.9914 1.1212 2.0825 2.2732 1.3505 1.3189 1.3778 1.1969 1.3148 1.1369 1.3839 1.3727 1.2932 1.4861 1.4194 1.2370 3.6019 1.3431 1.2117 1.1993 2.1260 1.5820 1.0723 1.0621 1.1628 1.1016 1.1217 1.0428 1.0935 1.6708 1.2242 1.0946 6.0041 9.0705 5.9666 1.0692 1.0637 1.0638 1.0362 1.0362 1.0383 1.0812 1.0822 1.0868 1.0979 1.0997 1.1008 1.0996 1.1000 1.0998 1.0993 1.0989 1.0844 1.0879 1.0922 1.0959 1.1015 1.0770 1.0734
irintensity: 0.2349 0.0046 0.4855 1.3693 3.4652 3.6993 0.4452 0.7723 0.6292 1.1334 0.8305 0.2495 0.2369 0.5376 0.1451 1.7106 8.4206 0.0853 1.2453 13.4876 1.9712 6.1392 0.2180 3.2063 2.1848 12.5404 25.9044 1.9482 0.0490 7.0809 77.4324 54.6073 8.6253 7.2307 38.5418 27.6902 16.3217 75.5394 1.1299 30.0572 8.1451 7.0543 1.1260 11.4469 0.4330 7.3549 0.3054 0.3700 0.8614 7.1892 1.2252 5.9486 2.9327 6.8378 11.2039 4.3413 38.0812 15.3964 2.8856 44.4796 0.1007 4.4349 1.0686 19.9385 10.9153 1.8227 10.8638 3.7610 0.7352 0.6541 4.1735 3.9408 4.9750 6.6713 2.8006 11.6907 21.1439 1.2672 10.9634 13.4629 22.8971 8.4730 237.4158 15.0511 6.9047 24.1526 40.5333 57.2327 11.6837 1.6905 26.8095 19.9872 22.0049 8.8164 194.7998 8.7167 91.0343 34.6431 32.2947 33.9537 29.4167 28.7936 9.9498 6.9377 23.6112 22.6792 20.3669 71.6641 43.3438 36.2031 51.7847 46.6196 13.2720 1.3933 1.8066 14.6021 39.9433 25.8537 164.4020 0.4180
temp: 298.150 k
press: 1.00000 atm
elementType: 8 7 7 6 6 6 6 6 6 6 6 6 6 6 6 6 6 6 1 1 1 1 1 1 1 1 1 1 1 1 1 1 1 1 1 1 1 1 1 1 1 1
symmnumber: 1
zpe: 955223.6 jmol-1
zpe.correction: 0.363825 hartree
zpe.thermalcorrener: 0.383171 hartree
zpe.thermalcorrenthalpy: 0.384115 hartree
zpe.thermalcorrgfe: 0.314043 hartree
zpe.sumelectzpe: -769.338729 hartree
zpe.sumelectthermal: -769.319384 hartree
zpe.sumelectthermalent: -769.318440 hartree
zpe.sumelectthermalfe: -769.388512 hartree
dipole: 2.6440 2.3585 2.4205
dipole: 4.2910
quadrupole: -101.2588 -114.1045 -107.9434
quadrupole: -3.5650 -0.7526 -6.1494
quadrupole: 6.5101 -6.3356 -0.1745 -3.5650 -0.7526 -6.1494
hfenergy: -769.7025549 hartree
pointgroup: C01 [X(C15H24N2O1)]
dipole: -1.2226357 -0.7663981 -0.8762441 debye
polarizability: 184.0837239|-0.9257905|174.1506779|-20.8509097|11.7751719|171.1927482 unknown
InChI: InChI=1S/C15H24N2O/c1-4-11-16-12(3)15(18)17-14(5-2)13-9-7-6-8-10-13/h6-10,12,14,16-17H,4-5,11H2,1-3H3
charge 0 multiplicity 1
42 atoms
O  0.313165 1.673611 1.946156
N  -0.105403 -0.268429 0.704083
N  -2.551446 0.459578 -0.057669
C  1.160133 -0.964031 1.025817
C  -1.760854 1.537722 0.602601
C  0.87892 -2.429317 1.437116
C  2.165323 -0.805185 -0.129081
C  -0.419006 0.986578 1.162915
C  -3.399509 0.88782 -1.20056
C  -2.523366 2.31642 1.700602
C  0.063707 -2.534264 2.741911
C  -4.165518 -0.307913 -1.800366
C  2.828085 0.442291 -0.280682
C  2.437918 -1.836887 -1.061807
C  3.738063 0.653173 -1.338511
C  3.348401 -1.627338 -2.123967
C  -5.050563 0.103206 -2.996525
C  4.001608 -0.38262 -2.266616
H  1.564963 -0.421499 1.902934
H  -1.469279 2.252625 -0.193679
H  0.341421 -2.952993 0.619817
H  1.848774 -2.948842 1.559519
H  -0.790767 -0.654007 0.034336
H  -3.117507 -0.048833 0.639868
H  -2.734517 1.32197 -1.972413
H  -4.130744 1.68355 -0.917527
H  -2.866402 1.630526 2.498377
H  -1.85621 3.061139 2.165111
H  -3.403672 2.832295 1.276151
H  0.615151 -2.087423 3.5898
H  -0.15159 -3.588653 2.993713
H  -0.899035 -1.998987 2.652559
H  -4.798707 -0.769389 -1.013905
H  -3.433539 -1.077948 -2.110696
H  2.618744 1.244084 0.43808
H  1.947709 -2.811848 -0.964299
H  -5.803182 0.856613 -2.696956
H  -4.441269 0.540442 -3.809551
H  -5.590458 -0.766988 -3.410822
H  4.244278 1.620189 -1.437602
H  3.550212 -2.436042 -2.836061
H  4.709767 -0.222199 -3.087568
