program: Gaussian 09
title: 000211610
version: EM64L-G09RevD.01
frameworkgroup: C1[X(C16H24N2O)]
method: RPBEPBE
basis: SDD
operation: Freq
keyword: #p
keyword: freq=noraman
keyword: PBEPBE/SDD
title: #p freq=noraman PBEPBE/SDD
converged: YES YES NO NO
title: Mulliken charges:
elementType: O N N C C C C C C C C C C C C C C C C H H H H H H H H H H H H H H H H H H H H H H H H
charge: -0.295509 -0.387295 -0.366838 -0.141946 -0.495492 -0.503866 -0.251296 0.551192 0.185781 -0.395092 -0.451435 -0.184248 -0.242226 -0.226088 -0.700927 -0.243133 -0.324720 -0.377290 -0.678076 0.233763 0.234856 0.223664 0.261173 0.228271 0.230041 0.361562 0.226580 0.238732 0.235416 0.222785 0.226201 0.254306 0.211386 0.264194 0.207754 0.228645 0.212377 0.181483 0.187474 0.215382 0.221107 0.211920 0.209431
chargesum: 0.00000
title: Mulliken charges with hydrogens summed into heavy atoms:
elementType: O N N C C C C C C C C C C C C C C C C
charge: -0.295509 -0.025733 -0.112532 0.091818 -0.036972 -0.014422 -0.021254 0.551192 0.185781 -0.168513 -0.212703 0.051167 -0.019442 0.000113 -0.017593 -0.014488 0.069141 0.025566 -0.035618
polarizability: 1.89875916e+02 -1.50618861e+01 2.07332181e+02 9.29929152e+00 6.80304523e+00 1.59100211e+02
1716.lowfreq: -9.3722 -2.5183 -0.0005 0.0006 0.0006 3.4996 7.9911 15.5648 28.2914
frequency: -7.6958 14.7833 28.2468 48.7461 51.6320 53.8819 68.5262 74.4512 108.0663 123.1707 143.8785 182.1778 207.2076 219.4498 223.3462 227.0924 263.7435 296.1117 321.9572 335.9052 361.2517 370.0711 402.2311 414.3575 461.8863 515.9987 559.7095 587.8411 616.8256 628.3717 702.8053 708.4198 716.3843 757.2596 761.5763 773.5242 800.1201 819.7399 823.6992 850.9118 857.5570 881.3580 891.1839 909.9859 914.3796 916.8593 930.1542 951.1079 973.5846 991.2910 994.0143 1022.8857 1028.0000 1038.9592 1047.0392 1057.3018 1064.3506 1076.4782 1083.1993 1096.0085 1099.8229 1125.6583 1135.1742 1146.0229 1163.0482 1172.4909 1174.6259 1189.1431 1199.5052 1211.7187 1216.8399 1235.5211 1274.4294 1277.2523 1281.2033 1290.7477 1318.9022 1323.8355 1337.6315 1373.7608 1379.4772 1381.9255 1393.4184 1396.0940 1441.9700 1442.0208 1445.8749 1458.6880 1465.3694 1471.5338 1472.8062 1477.9185 1479.8741 1481.8729 1483.6055 1493.4138 1592.8971 1608.1568 1613.9373 2885.1124 2968.3205 2977.4712 2982.1299 2992.2527 3007.2817 3008.7056 3034.8102 3073.5219 3075.6749 3079.1552 3091.0493 3097.4768 3103.3854 3108.7088 3115.2358 3121.3144 3133.4125 3144.5995 3162.6436 3189.3326 3208.3020 3387.9703 3402.9299
redmass: 3.7549 4.0717 3.8332 3.1232 2.5311 3.2435 3.1559 3.0638 2.7748 3.2216 2.7834 3.4007 1.2136 2.2246 2.0748 1.7158 3.6871 3.7236 4.5282 4.0801 3.6076 3.0611 2.7949 2.6778 3.6441 3.5310 3.8750 3.8526 6.3169 4.9055 1.6379 1.4472 3.7103 1.0965 1.5439 1.4173 1.6381 1.4400 1.6485 1.2524 2.7089 1.4197 1.7133 1.5040 2.0530 1.8895 2.2528 2.6123 1.3926 5.8010 1.3408 3.0938 2.2250 1.2884 2.5783 1.9722 1.2590 1.7841 2.2772 1.1794 2.2365 2.0719 3.0942 1.9200 1.4094 1.0579 2.0533 1.1253 1.9034 2.1294 1.8018 1.3467 1.3801 1.2249 1.6251 1.1351 1.3869 1.3850 1.3003 1.4364 1.2302 4.7551 1.2123 1.6433 1.6200 1.3371 1.1638 1.7330 1.1397 1.0681 1.3441 1.0962 1.0431 1.0681 2.3173 1.0914 6.1359 8.8040 6.2288 1.0698 1.0636 1.0363 1.0374 1.0822 1.0868 1.0845 1.0997 1.1008 1.0998 1.0992 1.0514 1.0650 1.0989 1.0869 1.0866 1.0866 1.0913 1.0960 1.1015 1.1170 1.1149 1.0773 1.0734
irintensity: 0.1798 0.3440 0.4462 0.2030 3.2829 0.7705 3.3032 0.6130 0.4464 2.1194 0.4895 1.3011 0.5104 1.1804 0.3169 1.0740 5.9011 1.4662 6.0633 8.2680 0.9312 2.1593 0.0306 2.7351 15.2062 12.0735 30.8514 12.0197 0.6060 7.6953 85.2730 62.1999 0.1550 8.3803 18.0960 21.5925 8.3926 73.6839 27.4286 0.1561 12.2949 8.5252 7.0503 7.6616 5.7729 0.9664 1.0464 32.2847 0.0231 0.9407 0.1324 0.8839 5.6851 32.6548 7.3711 1.8956 12.2757 9.3779 10.7663 3.7566 30.3133 3.8277 64.7693 2.7995 1.3305 0.0251 2.8951 0.5831 11.9088 13.3690 8.2528 2.7405 7.4146 0.6133 2.4355 4.4360 6.2169 3.6609 5.7202 10.3762 22.8784 0.1854 14.0970 2.6401 9.8921 20.3907 3.2791 322.3934 43.4660 6.5659 52.4070 42.8344 11.6126 5.4949 10.4126 21.4840 24.2558 201.1806 5.6777 93.5106 32.9388 34.2932 27.2889 8.7973 22.6675 12.4352 23.3386 72.0567 39.0828 43.9527 18.9113 18.6487 13.0790 8.1577 10.7396 2.2230 13.0513 40.3688 24.7614 3.0234 22.4198 163.4961 0.7269
temp: 298.150 k
press: 1.00000 atm
elementType: 8 7 7 6 6 6 6 6 6 6 6 6 6 6 6 6 6 6 6 1 1 1 1 1 1 1 1 1 1 1 1 1 1 1 1 1 1 1 1 1 1 1 1
symmnumber: 1
zpe: 970351.1 jmol-1
zpe.correction: 0.369587 hartree
zpe.thermalcorrener: 0.389247 hartree
zpe.thermalcorrenthalpy: 0.390192 hartree
zpe.thermalcorrgfe: 0.318813 hartree
zpe.sumelectzpe: -807.349606 hartree
zpe.sumelectthermal: -807.329946 hartree
zpe.sumelectthermalent: -807.329002 hartree
zpe.sumelectthermalfe: -807.400381 hartree
dipole: 2.0452 3.0600 2.1437
dipole: 4.2594
quadrupole: -105.2792 -121.0395 -112.0508
quadrupole: -2.5218 3.5057 -5.3326
quadrupole: 7.5106 -8.2497 0.7390 -2.5218 3.5057 -5.3326
hfenergy: -807.7191935 hartree
pointgroup: C01 [X(C16H24N2O1)]
dipole: 0.8285945 0.579142 -1.336507 debye
polarizability: 196.1055857|-0.9797271|156.1693735|14.2701044|-9.6575974|204.0333482 unknown
InChI: InChI=1S/C16H24N2O/c1-3-11-17-12(2)16(19)18-15(14-9-10-14)13-7-5-4-6-8-13/h4-8,12,14-15,17-18H,3,9-11H2,1-2H3
charge 0 multiplicity 1
43 atoms
O  0.380543 -1.291698 2.596253
N  0.190761 0.037859 0.677327
N  2.68213 -0.397142 -0.153802
C  -1.121743 1.929858 1.629207
C  -2.210921 2.310186 2.641962
C  -0.776242 2.026499 3.120693
C  -1.168005 0.549158 0.965499
C  -2.014774 0.529467 -0.309757
C  0.848134 -0.840579 1.501058
C  -1.755593 1.431191 -1.3749
C  -3.064503 -0.40995 -0.45744
C  2.230833 -1.292281 0.950173
C  -2.526029 1.39275 -2.557692
C  -3.842502 -0.448278 -1.637033
C  3.244532 -1.449563 2.107992
C  -3.574905 0.453003 -2.692571
C  3.52679 -1.031401 -1.198575
C  3.913829 -0.013268 -2.289403
C  4.797657 -0.637187 -3.390208
H  -0.753888 2.738844 0.986487
H  -2.572955 3.342141 2.653234
H  -2.979828 1.563785 2.867534
H  -0.586871 1.086335 3.647285
H  -0.168321 2.871222 3.458573
H  -1.595493 -0.160497 1.700578
H  0.712995 0.289966 -0.176589
H  -0.952456 2.173319 -1.282907
H  -3.270523 -1.116156 0.356064
H  2.054649 -2.290585 0.500247
H  -2.3134 2.09579 -3.371263
H  -4.65343 -1.179226 -1.732588
H  3.151792 0.437071 0.23229
H  4.186427 -1.901406 1.747582
H  2.816327 -2.087591 2.898652
H  3.474145 -0.466146 2.560418
H  -4.176026 0.424925 -3.608369
H  2.941602 -1.853687 -1.654793
H  4.456781 -1.488362 -0.780793
H  4.453149 0.836899 -1.821577
H  2.987383 0.402694 -2.729743
H  5.061652 0.109975 -4.159942
H  4.275226 -1.471021 -3.895529
H  5.739871 -1.035914 -2.969335
