program: Gaussian 09
title: 000216979
version: EM64L-G09RevD.01
frameworkgroup: C1[X(C14H16I3NO4)]
method: RPBEPBE
basis: SDD
operation: Freq
keyword: #p
keyword: freq=noraman
keyword: PBEPBE/SDD
title: #p freq=noraman PBEPBE/SDD
converged: YES YES NO NO
title: Mulliken charges:
elementType: I I I O O O O N C C C C C C C C C C C C C C H H H H H H H H H H H H H H H H
charge: 0.168887 0.149470 0.165543 -0.264085 -0.272956 -0.413284 -0.244838 -0.243332 -0.347769 -0.346741 0.616383 0.197994 -0.510357 -0.617995 -0.484560 -0.532655 -0.686840 0.620014 -0.112219 -0.556883 0.185461 -0.510649 0.222080 0.251265 0.243970 0.206304 0.257367 0.277758 0.261656 0.294824 0.219086 0.222960 0.206572 0.277955 0.247489 0.239703 0.236240 0.376180
chargesum: 0.00000
title: Mulliken charges with hydrogens summed into heavy atoms:
elementType: I I I O O O O N C C C C C C C C C C C C C C
charge: 0.168887 0.149470 0.165543 -0.264085 -0.272956 -0.037105 -0.244838 -0.243332 0.125577 0.103533 0.616383 0.197994 0.024769 -0.617995 0.071920 -0.532655 -0.038222 0.620014 0.165736 -0.556883 0.185461 0.212782
polarizability: 3.10188278e+02 -9.77310856e+00 2.61539194e+02 -2.71935837e+01 -9.61531722e+00 1.81362578e+02
1716.lowfreq: -14.0107 -7.4208 -2.6084 -0.0003 0.0001 0.0003 14.9821 16.4614 27.9072
frequency: 14.2663 15.1383 27.7318 30.2004 41.5598 51.2165 60.6138 62.4378 71.6118 78.4740 84.5050 86.8272 94.3134 110.2500 112.0312 120.9032 156.5485 163.2666 177.4827 183.6598 188.2879 220.9383 226.7811 239.8861 267.5446 293.6738 313.2093 345.0980 374.5899 407.8559 455.7525 477.3791 497.2490 516.4672 529.7682 557.1438 581.4175 596.8298 609.7962 650.3844 675.6459 694.0062 722.0514 744.6227 761.8228 799.1510 815.6664 858.9674 874.4778 891.2147 896.3731 933.5510 984.9219 1013.1310 1016.6722 1045.3836 1048.0205 1067.7223 1098.0575 1105.9040 1112.9035 1146.6952 1152.7320 1156.5243 1208.4801 1226.9800 1233.1170 1245.3044 1260.1416 1272.4612 1299.9504 1305.9191 1308.6090 1328.6236 1355.2873 1367.0150 1380.9511 1392.6208 1400.7421 1433.4490 1440.7679 1443.6032 1452.1256 1459.1671 1460.9086 1472.6193 1479.3080 1485.2277 1505.5287 1529.4233 1595.9823 1661.2037 2975.2020 2980.8023 2990.6997 2999.7045 3000.1764 3010.2632 3049.3766 3055.9897 3065.2081 3076.5852 3078.4791 3079.7705 3088.8790 3137.7079 3182.5681 3513.0317
redmass: 8.7161 10.8268 4.6877 7.3389 5.2648 5.2753 3.9724 4.8642 2.9770 2.4027 5.8702 4.7806 13.7130 2.1335 1.9224 2.9297 4.3705 80.5805 5.3850 4.2395 4.2094 1.3516 4.9958 3.4165 6.2768 4.6326 4.7834 5.0663 5.7461 7.6090 4.9162 5.4162 3.4406 2.6998 2.9114 6.0141 4.6885 5.1816 6.1795 1.4363 5.1451 7.7550 3.5934 1.3747 7.2242 1.6885 5.0017 1.5593 1.3822 1.9763 3.2463 4.4478 4.8820 2.6269 5.6962 3.2462 3.0123 2.7093 1.2356 2.5328 2.2675 1.3925 1.8620 1.2079 2.1606 1.6244 2.0392 2.1020 1.4038 1.6886 2.1805 1.3331 4.9413 1.8636 1.8915 1.5541 2.0927 1.2150 3.1152 1.2839 1.1014 1.1088 1.0993 1.0542 1.0556 1.0595 1.0433 1.0744 9.3541 8.1528 7.6839 8.0383 1.0360 1.0307 1.0641 1.0598 1.0643 1.0599 1.0997 1.0935 1.1028 1.0963 1.1055 1.0988 1.1050 1.1021 1.0930 1.0639
irintensity: 0.3531 0.1484 0.1861 1.0018 1.1959 0.2819 0.3654 0.6158 3.6753 0.0604 1.1035 1.5138 0.0275 1.8686 0.5539 1.7384 5.9324 0.0540 1.4592 2.2692 2.4519 0.2718 2.8074 0.3044 5.9779 1.8847 6.9430 5.4732 2.4164 1.8296 24.9316 23.6179 17.4545 50.8578 10.8069 14.8238 27.4749 30.5185 24.5982 109.8971 12.5887 5.0822 24.1231 22.6636 3.7778 7.9026 13.0167 4.3395 10.4681 13.4955 18.6880 20.2384 13.0837 64.8553 16.0010 78.2754 53.6972 137.2684 0.0048 39.5625 0.6643 7.7854 33.6235 1.3229 74.7056 13.3937 3.1266 160.2981 18.6977 20.0950 33.8520 0.6998 22.1283 122.9543 116.8167 67.4391 32.1469 8.7882 180.9827 33.3363 6.9369 25.2919 52.5072 10.3818 11.7623 3.3161 11.1859 12.2134 9.0286 1.4500 260.7192 166.7849 38.8684 49.6961 4.9125 19.2076 23.4806 26.2371 5.3819 6.6590 4.1730 5.2842 20.5648 37.2561 53.1215 16.9585 0.3154 24.3415
temp: 298.150 k
press: 1.00000 atm
elementType: 53 53 53 8 8 8 8 7 6 6 6 6 6 6 6 6 6 6 6 6 6 6 1 1 1 1 1 1 1 1 1 1 1 1 1 1 1 1
symmnumber: 1
zpe: 723736.4 jmol-1
zpe.correction: 0.275657 hartree
zpe.thermalcorrener: 0.301679 hartree
zpe.thermalcorrenthalpy: 0.302623 hartree
zpe.thermalcorrgfe: 0.211705 hartree
zpe.sumelectzpe: -931.589754 hartree
zpe.sumelectthermal: -931.563732 hartree
zpe.sumelectthermalent: -931.562788 hartree
zpe.sumelectthermalfe: -931.653706 hartree
dipole: -2.0195 -0.7182 1.0454
dipole: 2.3848
quadrupole: -180.3751 -165.6670 -165.7113
quadrupole: -4.4061 -2.5388 1.2875
quadrupole: -9.7906 4.9174 4.8732 -4.4061 -2.5388 1.2875
hfenergy: -931.8654111 hartree
pointgroup: C01 [X(C14H16I3N1O4)]
dipole: 0.700545 0.4230949 -0.4588407 debye
polarizability: 299.683909|46.0868736|192.4384307|-3.8703655|8.4178517|260.9677098 unknown
InChI: InChI=1S/C14H16I3NO4/c1-3-6-18(10(19)4-5-11(20)21)13-8(15)7-9(16)14(22-2)12(13)17/h7,20H,3-6H2,1-2H3
charge 0 multiplicity 1
38 atoms
I  1.015304 -0.315432 2.845124
I  -0.598335 -1.235712 -3.086543
I  4.981467 0.784414 -1.70688
O  -3.005465 -0.858486 0.88553
O  3.701384 0.523272 1.287414
O  -4.207815 3.871315 -0.553114
O  -2.11634 3.91938 0.449202
N  -0.800781 -1.219813 0.264693
C  -0.880789 -2.616285 0.798933
C  -1.584709 -3.617617 -0.142376
C  0.467814 -0.72408 -0.188227
C  -1.92888 -0.396309 0.401533
C  -1.774773 1.071261 -0.008544
C  1.451949 -0.284865 0.747657
C  -3.145488 1.749108 -0.161969
C  0.812979 -0.671025 -1.569483
C  -1.715726 -4.999353 0.534208
C  2.734813 0.174102 0.34144
C  2.083474 -0.230502 -1.998225
C  3.037261 0.181143 -1.045901
C  -3.055166 3.254279 -0.045593
C  3.751398 1.959357 1.667746
H  0.150576 -2.949965 1.014586
H  -1.436095 -2.569856 1.753881
H  -2.585568 -3.222804 -0.392451
H  -1.019015 -3.709094 -1.087718
H  -1.187284 1.162478 -0.938552
H  -1.19386 1.596113 0.776463
H  -3.632345 1.487436 -1.117209
H  -3.825487 1.373326 0.628533
H  -2.311052 -4.93142 1.463957
H  -2.219286 -5.719191 -0.135438
H  -0.725145 -5.418615 0.794914
H  2.328481 -0.212839 -3.061925
H  4.559445 2.02682 2.409978
H  2.793331 2.27455 2.119465
H  3.9887 2.586541 0.789443
H  -4.133969 4.856165 -0.42465
