program: Gaussian 09
title: 000216827
version: EM64L-G09RevD.01
frameworkgroup: C1[X(C10H22NO3PS2)]
method: RPBEPBE
basis: SDD
operation: Freq
keyword: #p
keyword: freq=noraman
keyword: PBEPBE/SDD
title: #p freq=noraman PBEPBE/SDD
converged: YES YES NO NO
title: Mulliken charges:
elementType: S S P O O O N C C C C C C C C C C H H H H H H H H H H H H H H H H H H H H H H
charge: 0.120018 -0.244952 0.560001 -0.476951 -0.486171 -0.273027 -0.120282 -0.343847 -0.376217 0.296499 -0.762580 -0.657753 -0.641676 -0.219408 -0.202609 -0.652231 -0.656939 0.262842 0.205291 0.237379 0.225049 0.314080 0.296764 0.220313 0.252031 0.203751 0.220797 0.228230 0.220793 0.235743 0.220607 0.229223 0.225935 0.213010 0.229953 0.224625 0.211921 0.236940 0.222849
chargesum: 0.00000
title: Mulliken charges with hydrogens summed into heavy atoms:
elementType: S S P O O O N C C C C C C C C C C
charge: 0.120018 -0.244952 0.560001 -0.476951 -0.486171 -0.273027 -0.120282 0.124286 0.086210 0.296499 -0.151735 0.018342 0.028144 0.236943 0.252549 0.015357 0.014770
polarizability: 2.60553959e+02 3.60999496e+00 1.76116581e+02 1.28330567e+01 1.17673724e+01 1.64635052e+02
1716.lowfreq: -14.8728 0.0011 0.0016 0.0018 0.6495 6.5221 15.6793 21.2327 28.5802
frequency: 11.3511 20.7511 28.5132 35.4082 45.8542 53.1785 54.6297 58.6107 69.2703 84.1035 98.6156 120.8115 123.8868 132.0219 141.3195 148.5960 205.2561 207.4922 217.0840 221.6958 242.2193 258.4008 279.1828 282.6619 288.3459 314.3542 320.3481 362.9024 407.6442 432.9136 454.3243 485.3295 553.5335 562.0253 589.0977 653.7725 685.5917 708.4511 753.9669 780.3310 788.9179 809.4765 812.2284 862.7792 873.1009 909.7153 915.0707 942.3279 1018.1624 1023.6097 1025.8003 1071.0588 1080.7810 1098.3136 1102.2114 1103.7919 1130.6068 1134.6283 1139.3518 1142.9894 1212.2781 1233.3806 1252.0584 1256.4813 1275.0509 1301.4026 1342.3897 1353.9645 1354.2722 1358.3342 1385.9371 1391.3318 1393.2233 1393.7800 1422.0806 1433.3342 1456.5316 1457.4839 1458.3296 1467.8729 1469.9478 1476.1513 1477.3197 1478.1771 1482.3135 1487.3627 1488.8467 1492.1266 1568.0705 2980.9496 2985.0130 2986.2159 2989.4211 2993.7260 2994.3321 3001.2443 3006.9139 3029.4621 3044.9802 3054.1148 3058.0024 3068.8837 3085.4399 3085.9309 3089.9016 3090.0671 3092.8494 3102.8414 3105.6048 3107.8627 3110.1475
redmass: 3.4753 3.9214 3.7270 3.9405 2.3584 2.3075 3.0226 2.2006 3.5192 5.2240 5.6772 6.6094 3.6855 3.4602 2.8353 4.9382 3.0066 1.1694 1.9847 1.3102 1.2977 1.8687 3.1563 3.7894 6.7825 2.7401 5.2750 2.9058 5.8194 3.2085 8.2212 2.9691 10.9142 3.6610 3.3224 6.7146 7.7602 4.5609 3.6881 1.1620 1.3233 1.0912 1.0925 4.0494 3.6153 1.9115 2.1490 2.1634 2.5051 2.7223 2.7229 2.0644 1.8536 1.7641 2.2326 2.2233 1.4104 1.4244 1.1494 1.7793 2.8510 1.3819 1.1495 1.1357 1.3779 1.3458 1.2563 1.2590 1.2516 1.2960 1.2153 1.2099 1.2421 1.2434 2.7451 1.1157 1.1079 1.0427 1.0407 1.0456 1.0436 1.0521 1.0647 1.0593 1.0584 1.0799 1.0797 1.1185 5.4906 1.0558 1.0359 1.0355 1.0523 1.0367 1.0397 1.0633 1.0632 1.0588 1.1075 1.1080 1.0995 1.0995 1.0993 1.0990 1.0983 1.0983 1.1019 1.1020 1.1019 1.1021 1.1042
irintensity: 1.0141 1.2513 0.7885 0.9730 0.8394 0.4217 0.5187 0.9876 2.8132 2.6489 1.4972 0.8720 3.3666 2.0748 11.5439 5.0408 9.8002 0.1635 3.9156 9.6525 1.3204 6.9349 2.4211 4.7865 23.8819 10.1864 3.7817 23.5154 4.0620 6.5700 15.3857 2.0170 122.2809 7.8009 7.6121 103.8224 101.4052 13.5204 23.1291 3.9748 9.7754 2.8520 2.4035 189.1473 77.0598 3.3965 5.7491 7.9721 142.2927 14.5735 76.6555 13.9246 10.8807 17.0018 9.1629 13.7054 6.0010 5.1851 5.7687 49.4364 32.7543 33.8102 1.3423 0.5173 42.8089 44.1335 5.7433 8.0704 6.1322 9.3836 16.1834 13.3710 32.4392 27.0718 103.2194 24.6731 10.7893 16.1687 13.5229 4.4734 14.6070 5.0404 9.6091 4.8784 8.2192 7.7109 8.1611 12.7528 320.1834 30.1411 27.1274 19.1046 25.3683 27.3897 25.1425 34.4558 34.9739 19.5011 11.0700 10.9412 5.0784 10.5778 35.4832 38.1596 31.9332 31.0656 41.6519 32.6444 34.3884 33.6909 0.9199
temp: 298.150 k
press: 1.00000 atm
elementType: 16 16 15 8 8 8 7 6 6 6 6 6 6 6 6 6 6 1 1 1 1 1 1 1 1 1 1 1 1 1 1 1 1 1 1 1 1 1 1
symmnumber: 1
zpe: 832376.6 jmol-1
zpe.correction: 0.317036 hartree
zpe.thermalcorrener: 0.341213 hartree
zpe.thermalcorrenthalpy: 0.342157 hartree
zpe.thermalcorrgfe: 0.258129 hartree
zpe.sumelectzpe: -1810.643795 hartree
zpe.sumelectthermal: -1810.619618 hartree
zpe.sumelectthermalent: -1810.618674 hartree
zpe.sumelectthermalfe: -1810.702702 hartree
dipole: 3.0538 3.2120 6.3583
dipole: 7.7505
quadrupole: -117.8517 -119.5166 -133.8689
quadrupole: 3.8788 -1.4804 -5.9647
quadrupole: 5.8940 4.2291 -10.1232 3.8788 -1.4804 -5.9647
hfenergy: -1810.9608304 hartree
pointgroup: C01 [X(C10H22N1O3P1S2)]
dipole: -0.8941103 -0.5558257 2.8617854 debye
polarizability: 256.1977122|-3.6719689|169.6652481|-23.517104|-12.3640764|175.4426322 unknown
InChI: InChI=1S/C10H22NO3PS2/c1-5-11(6-2)10(12)9-17-15(16,13-7-3)14-8-4/h5-9H2,1-4H3
charge 0 multiplicity 1
39 atoms
S  0.233251 0.512946 -2.003467
S  3.927103 0.148717 -2.289957
P  2.25848 0.030624 -1.076259
O  2.320889 0.991553 0.394021
O  1.888733 -1.48597 -0.3097
O  -2.538162 0.932078 -1.884396
N  -3.173603 0.020284 0.163353
C  -4.603339 0.281404 -0.143156
C  -2.854388 -0.632957 1.453725
C  -2.225101 0.385629 -0.775271
C  -0.760693 0.10595 -0.430343
C  -5.072195 1.660623 0.365745
C  -2.949443 -2.174394 1.395512
C  2.874461 2.371194 0.295887
C  3.008911 -2.220815 0.353584
C  2.942423 2.90913 1.722861
C  2.449441 -3.586292 0.740443
H  -4.723765 0.22927 -1.238259
H  -5.20296 -0.528924 0.312338
H  -1.845264 -0.328999 1.7817
H  -3.559367 -0.242042 2.211859
H  -0.568451 -0.945649 -0.169012
H  -0.388226 0.75237 0.382593
H  -6.144282 1.806489 0.139509
H  -4.502305 2.462848 -0.13264
H  -4.937861 1.759316 1.458862
H  -3.958829 -2.499396 1.086186
H  -2.222893 -2.590976 0.675663
H  -2.739889 -2.60962 2.389815
H  3.873915 2.324957 -0.177369
H  2.204528 2.982304 -0.340296
H  3.850515 -2.306681 -0.360333
H  3.336283 -1.639817 1.236029
H  3.345255 3.938865 1.714201
H  3.60193 2.281117 2.34571
H  1.940457 2.931593 2.184668
H  3.234318 -4.182577 1.241777
H  2.109468 -4.135012 -0.153939
H  1.597855 -3.480143 1.434451
