program: Gaussian 09
title: 000211603
version: EM64L-G09RevD.01
frameworkgroup: C1[X(C16H25N3O)]
method: RPBEPBE
basis: SDD
operation: Freq
keyword: #p
keyword: freq=noraman
keyword: PBEPBE/SDD
title: #p freq=noraman PBEPBE/SDD
converged: YES YES NO NO
title: Mulliken charges:
elementType: O N N N C C C C C C C C C C C C C C C C H H H H H H H H H H H H H H H H H H H H H H H H H
charge: -0.293384 -0.166337 -0.105361 -0.260454 -0.026744 -0.510457 -0.394515 -0.379014 -0.323425 -0.384049 0.184174 -0.720685 -0.701860 0.412572 -0.648752 -0.354586 -0.377298 -0.225826 -0.224089 -0.260349 0.204242 0.230898 0.230672 0.251730 0.241385 0.241750 0.240713 0.177213 0.237450 0.227694 0.232572 0.231493 0.215393 0.217484 0.221586 0.224561 0.218048 0.215809 0.235204 0.284134 0.264853 0.239516 0.224762 0.223552 0.227725
chargesum: 0.00000
title: Mulliken charges with hydrogens summed into heavy atoms:
elementType: O N N N C C C C C C C C C C C C C C C C
charge: -0.293384 -0.166337 -0.105361 -0.260454 0.177498 -0.048887 0.098601 0.103449 0.091238 0.076217 0.184174 -0.056315 -0.037665 0.412572 0.086394 -0.089733 -0.137782 -0.001064 -0.000537 -0.032624
polarizability: 2.44110261e+02 -2.13135253e+01 2.01478837e+02 -1.58307492e+01 -7.19469963e+00 1.49329692e+02
1716.lowfreq: -0.0004 0.0001 0.0004 6.4968 8.7058 22.9444 28.4278 37.2935 45.6056
frequency: 28.1632 37.1155 45.4665 77.6814 79.0541 84.2164 98.4074 119.3069 137.3955 148.9211 164.2393 179.3986 197.0262 202.4600 225.6957 248.3815 259.7681 286.9510 310.7243 321.5742 351.9895 379.4882 394.3896 409.2210 413.5643 446.0819 470.1808 513.2727 524.5717 566.1111 591.9771 614.7810 655.3450 698.0837 713.8355 728.2381 763.4891 766.6413 777.1024 812.0520 835.2871 847.8439 862.6246 887.7352 900.3257 906.7607 945.7334 966.8692 979.4482 983.9084 987.9573 991.8868 1007.0145 1027.4644 1049.2725 1064.1723 1078.2494 1082.0196 1090.0684 1097.7275 1113.5561 1123.9943 1126.5307 1165.0892 1170.5258 1173.5335 1187.3496 1189.1643 1200.8825 1205.6980 1219.5459 1231.6237 1276.8705 1284.9529 1296.0685 1305.3873 1309.8766 1318.5654 1326.4332 1340.1813 1341.8918 1355.9831 1363.1415 1376.6652 1381.2385 1384.0392 1391.0821 1427.3963 1445.4109 1464.8571 1468.3950 1470.5393 1479.0545 1483.0628 1483.2471 1486.2278 1489.7856 1491.2171 1493.4282 1497.8358 1502.3374 1571.9013 1586.8023 1614.2435 2832.3421 2851.4823 2972.4117 2979.6336 2980.7878 2986.0856 2991.3184 3006.4915 3012.9397 3033.3811 3052.2307 3054.5726 3059.7606 3061.3523 3074.3067 3079.3877 3082.2510 3084.6087 3088.7821 3114.7320 3124.2507 3131.2657 3149.5548 3155.0735 3167.9273
redmass: 3.9821 3.4751 3.7500 3.5784 3.5124 3.2602 2.9347 2.7369 3.3600 2.8688 1.0948 2.1035 3.6404 1.7365 1.2541 2.8190 2.7276 1.6001 4.1377 3.9382 2.2261 3.7626 4.2478 2.9461 3.3293 3.2039 2.9943 3.5577 2.4562 2.7176 4.4151 6.3075 5.5246 1.9401 8.6859 3.1596 1.8087 1.7421 1.5938 1.2384 1.2529 2.2949 2.4658 2.1307 1.4372 2.0059 1.2968 1.4123 3.5064 1.8007 2.8086 2.4105 2.1450 2.1199 2.1224 2.2620 2.0857 1.7651 1.8437 1.9974 2.4399 1.6316 1.4527 2.1237 1.0597 1.6446 1.9562 1.1243 2.2089 2.8467 1.4443 1.5780 1.2227 1.2571 1.9273 1.3254 1.7596 1.3838 1.4409 1.4210 1.2343 1.6929 3.3968 1.2626 7.0791 1.2551 1.2953 1.2530 2.3851 1.0694 1.0588 1.0615 1.0478 1.0696 1.1600 1.5238 1.0752 1.2423 1.1055 1.0916 1.0796 8.0409 6.8684 6.0843 1.0803 1.0723 1.0380 1.0359 1.0637 1.0358 1.0610 1.0614 1.0615 1.0864 1.1005 1.0978 1.0987 1.1027 1.0986 1.1003 1.1023 1.1019 1.1005 1.0986 1.0845 1.0883 1.0919 1.0955 1.1012
irintensity: 0.0167 0.6277 1.2687 4.2114 2.6952 1.2254 2.7541 0.2974 0.8882 1.1663 0.2493 1.5519 0.4600 0.3134 1.6246 7.2352 2.1614 1.0483 3.8201 0.6576 1.1636 1.6337 5.7187 2.4910 10.3977 2.8319 2.1723 2.3900 17.9152 3.3052 16.8372 0.4435 7.2321 45.8745 12.4570 6.0536 50.9833 20.3846 5.7062 2.5500 0.1044 2.1918 7.8067 20.4850 4.9265 8.2764 6.6475 0.6657 4.4497 0.9378 9.4995 16.2094 0.9656 23.4247 1.4255 20.4248 41.8383 6.4791 61.4184 6.2589 26.8360 14.3805 19.3503 4.6837 0.3930 22.6646 15.4809 7.0418 11.1341 27.8342 3.6135 1.8056 11.1504 17.7056 12.3358 6.9262 17.7923 42.9703 2.2664 6.9467 23.8616 24.6917 544.4837 24.6379 23.5188 14.6286 13.3677 104.1645 6.0086 15.8523 8.6854 9.5075 5.4950 8.0818 2.0038 151.9997 9.5466 22.6731 16.7369 2.0874 7.5929 311.4601 57.9649 56.8185 41.7996 118.0122 71.0427 20.0744 44.1468 32.6288 17.8765 11.9042 50.2404 14.3311 1.8281 13.6783 27.3624 23.6009 45.2207 69.7454 48.4403 32.5874 40.9913 1.0678 4.6082 8.2316 22.4367 28.7671 13.5430
temp: 298.150 k
press: 1.00000 atm
elementType: 8 7 7 7 6 6 6 6 6 6 6 6 6 6 6 6 6 6 6 6 1 1 1 1 1 1 1 1 1 1 1 1 1 1 1 1 1 1 1 1 1 1 1 1 1
symmnumber: 1
zpe: 1017886.1 jmol-1
zpe.correction: 0.387692 hartree
zpe.thermalcorrener: 0.408351 hartree
zpe.thermalcorrenthalpy: 0.409295 hartree
zpe.thermalcorrgfe: 0.337833 hartree
zpe.sumelectzpe: -862.626720 hartree
zpe.sumelectthermal: -862.606061 hartree
zpe.sumelectthermalent: -862.605117 hartree
zpe.sumelectthermalfe: -862.676579 hartree
dipole: -0.8272 -3.5855 -1.2040
dipole: 3.8717
quadrupole: -109.2211 -128.8162 -119.2632
quadrupole: 1.7257 -7.4196 -4.4024
quadrupole: 9.8791 -9.7161 -0.1630 1.7257 -7.4196 -4.4024
hfenergy: -863.0144124 hartree
pointgroup: C01 [X(C16H25N3O1)]
dipole: -0.3178774 -1.3864434 -0.5449329 debye
polarizability: 243.7918774|-19.8131417|201.4905188|-19.4427382|-3.9410264|149.6363943 unknown
InChI: InChI=1S/C16H25N3O/c1-4-18(5-2)15-11-12-19(13-15)16(20)17(3)14-9-7-6-8-10-14/h6-10,15H,4-5,11-13H2,1-3H3
charge 0 multiplicity 1
45 atoms
O  0.573374 2.796303 0.659706
N  -0.040621 0.658503 0.000836
N  -3.651687 -0.05506 -0.212825
N  2.239789 1.381763 -0.234099
C  -2.211735 -0.347993 -0.004402
C  -1.457633 -0.733375 -1.305527
C  -1.427247 0.902737 0.475005
C  0.024247 -0.480914 -0.952852
C  -4.306263 0.418773 1.04049
C  -4.389688 -1.143788 -0.911024
C  0.899314 1.660182 0.182578
C  -5.761204 0.880016 0.838996
C  -4.531527 -2.493061 -0.151763
C  2.900458 0.130223 -0.045164
C  3.058464 2.557908 -0.608453
C  2.495327 -0.781416 0.972111
C  4.037553 -0.197055 -0.836271
C  3.19764 -1.987179 1.171966
C  4.737032 -1.404288 -0.623018
C  4.322024 -2.312758 0.376986
H  -2.058194 -1.166205 0.747266
H  -1.789676 -0.058311 -2.116334
H  -1.625863 -1.777437 -1.619282
H  -1.844121 1.815783 0.007247
H  -1.433352 1.04568 1.569068
H  0.478863 -1.371758 -0.477623
H  0.642593 -0.220954 -1.829789
H  -4.270692 -0.356668 1.848572
H  -3.721698 1.280532 1.409394
H  -5.395279 -0.760344 -1.15928
H  -3.887813 -1.321514 -1.878826
H  -5.821571 1.606886 0.009394
H  -6.445811 0.041532 0.618938
H  -6.126721 1.371991 1.758749
H  -3.547322 -2.941825 0.076859
H  -5.079361 -2.370855 0.800399
H  -5.093803 -3.215466 -0.772169
H  3.234757 2.601515 -1.700342
H  4.032196 2.529957 -0.088725
H  2.510798 3.459105 -0.293039
H  1.646519 -0.528886 1.615777
H  4.371953 0.489231 -1.620926
H  2.872277 -2.66903 1.966266
H  5.608813 -1.634726 -1.246261
H  4.86729 -3.248252 0.54019
