program: Gaussian 09
title: 000211599
version: EM64L-G09RevD.01
frameworkgroup: C1[X(C12H7BrCl2O3S)]
method: RPBEPBE
basis: SDD
operation: Freq
keyword: #p
keyword: freq=noraman
keyword: PBEPBE/SDD
title: #p freq=noraman PBEPBE/SDD
converged: YES YES NO NO
title: Mulliken charges:
elementType: Br Cl Cl S O O O C C C C C C C C C C C C H H H H H H H
charge: 0.057776 -0.011201 -0.034729 0.955970 -0.364696 -0.484478 -0.484436 -0.052544 0.443145 -0.211019 -0.228679 -0.156092 -0.152317 -0.267108 -0.285833 -0.209477 -0.062694 -0.181816 -0.210879 0.290347 0.294064 0.267373 0.268007 0.290098 0.264705 0.266510
chargesum: 0.00000
title: Mulliken charges with hydrogens summed into heavy atoms:
elementType: Br Cl Cl S O O O C C C C C C C C C C C C
charge: 0.057776 -0.011201 -0.034729 0.955970 -0.364696 -0.484478 -0.484436 -0.052544 0.443145 0.079328 0.065385 0.111281 0.115689 -0.267108 0.004265 -0.209477 -0.062694 0.082889 0.055631
polarizability: 4.08654069e+02 -5.16431111e+00 2.00099112e+02 2.67923350e+00 1.43546346e+01 1.08385172e+02
1716.lowfreq: -4.5204 0.0010 0.0017 0.0027 1.4859 7.1663 13.2133 19.4909 35.5097
frequency: 12.8737 19.4779 35.4605 44.4152 63.3254 89.7175 93.0091 111.8393 141.4191 157.2688 182.0403 207.6382 227.3603 262.7642 265.3516 278.3794 308.5567 328.2769 339.0649 361.5799 398.9991 406.5986 430.8637 455.6122 464.8098 503.2893 542.0321 554.0647 591.8727 608.6841 680.1988 686.0304 700.8649 718.5872 808.8911 822.5373 827.8065 835.2897 874.6611 892.7331 944.1736 951.2815 962.1535 974.0386 977.3039 1025.0765 1043.9399 1055.1170 1067.5033 1109.6873 1134.9701 1182.0057 1197.1309 1234.7714 1286.3369 1349.5325 1368.6934 1376.9041 1378.6852 1433.2023 1446.1971 1540.1776 1559.4875 1568.9636 1587.4365 3161.5893 3162.5519 3166.6841 3180.8200 3180.9902 3183.4765 3186.0838
redmass: 18.7106 15.3357 4.2385 15.0880 8.7925 10.2717 10.7798 11.2876 16.1801 7.6829 18.0541 13.1862 8.4765 8.1150 11.1962 9.0053 25.2307 8.9983 7.6024 6.3952 8.8255 2.8870 7.3412 3.6088 8.3561 3.6357 8.6709 7.8614 5.1972 7.1025 7.3665 6.8275 4.1839 4.0012 1.3461 14.9757 1.2813 1.3932 6.6031 1.5854 1.3628 15.6414 1.3386 6.6743 1.4068 7.2185 5.3492 2.0133 1.8705 1.3507 1.5271 1.1253 3.5316 1.3841 1.2296 4.2483 5.5159 3.9549 5.1583 2.6068 2.0536 6.5877 6.0545 7.6841 8.1177 1.0899 1.0897 1.0890 1.0965 1.0934 1.0977 1.0975
irintensity: 0.3302 0.1883 0.1072 0.3151 2.1918 1.6212 0.4039 3.1406 3.2301 4.1078 2.1105 6.9118 0.7831 4.8731 3.8453 5.3999 0.0182 16.6722 58.0587 9.5206 21.7310 0.3482 18.1633 14.6000 49.9607 93.7727 18.7539 15.5238 11.6190 0.6094 2.7876 40.6012 5.7162 0.2857 36.5750 90.3270 9.6656 36.2204 85.8357 25.4232 1.0585 52.6257 1.9291 60.8158 3.2006 46.7220 95.9441 20.1681 41.5140 4.1767 1.4361 20.4461 26.3150 4.8033 1.1502 0.7166 4.0410 5.6994 17.9710 91.2319 58.6879 34.6521 58.5039 3.0738 0.7419 3.9082 3.5925 0.6770 0.0257 0.9985 5.3527 1.5810
temp: 298.150 k
press: 1.00000 atm
elementType: 35 17 17 16 8 8 8 6 6 6 6 6 6 6 6 6 6 6 6 1 1 1 1 1 1 1
symmnumber: 1
zpe: 414573.1 jmol-1
zpe.correction: 0.157903 hartree
zpe.thermalcorrener: 0.176824 hartree
zpe.thermalcorrenthalpy: 0.177768 hartree
zpe.thermalcorrgfe: 0.106022 hartree
zpe.sumelectzpe: -2017.259605 hartree
zpe.sumelectthermal: -2017.240684 hartree
zpe.sumelectthermalent: -2017.239740 hartree
zpe.sumelectthermalfe: -2017.311485 hartree
dipole: 1.8051 2.4556 -0.9850
dipole: 3.2029
quadrupole: -128.3707 -136.3404 -147.3483
quadrupole: -13.2419 0.3815 7.8472
quadrupole: 8.9824 1.0128 -9.9952 -13.2419 0.3815 7.8472
hfenergy: -2017.4175073 hartree
pointgroup: C01 [X(C12H7Br1Cl2O3S1)]
dipole: 0.5858956 -0.963476 0.5624779 debye
dipolederiv: -0.795458 0.18393 -0.1741286 0.2568154 -0.0885652 0.0488 -0.2334232 0.0491511 -0.0572611 -0.2638187 0.3945948 -0.0753898 0.1708544 -0.4411069 0.0562837 0.0275242 -0.0030257 -0.0343405 -0.6815142 0.3135919 0.0374022 0.5293116 -0.3756575 -0.0489692 0.0120029 -0.0189785 -0.0553939 2.0969658 -0.080644 0.0509306 -0.0531439 1.0339995 -0.1349817 -0.3897163 -0.2432855 1.2855293 -0.1272268 0.1954711 -0.1531228 0.1182567 -0.2446782 -0.0329395 -0.2782166 -0.0604021 -0.3241512 -0.8352094 -0.0535795 0.0180886 -0.3475394 -0.7024807 0.1783016 0.1552324 0.09804 -0.4682122 -0.6299665 0.0359312 -0.0590125 0.2045152 -0.3441227 -0.1228726 0.3766113 0.108569 -0.6575715 -0.1424722 0.0197106 -0.0086188 -0.0556094 -0.1236647 0.0511254 0.1211458 0.1115173 -0.2002629 -0.0210563 0.0209527 0.0767699 -0.0822421 0.0557102 0.0644951 0.0008571 -0.0366279 0.0710393 -0.1737523 0.0776721 0.0639671 -0.3757372 0.0001487 -0.0757774 -0.0864681 0.0227894 -0.0545881 -0.0440105 -0.1472345 0.0236485 0.4229891 -0.0372374 0.0746286 0.1891087 -0.0593541 -0.0457904 -0.5279297 -0.038014 -0.1492872 0.1014033 0.0521278 0.0515476 -0.1773394 0.005459 -0.1096986 -0.4377232 0.2716229 -0.0215274 0.2249817 -0.1071206 0.0539423 -0.1207963 0.0889493 -0.0594311 0.3910362 -0.6278116 0.1095468 0.0246731 0.5759018 -0.1645205 0.1000296 0.0331063 -0.0650203 -0.0822693 0.2253889 -0.030439 0.0199857 -0.1790144 0.061787 0.0493428 0.0098793 -0.0693393 1.4134747 -0.3737837 0.3903963 -0.4799341 0.2001944 -0.0587229 0.480077 -0.0621279 0.0182662 0.7970403 -0.6561493 0.003193 -1.1291522 0.4179062 0.1520046 -0.114762 0.0045213 -0.0294471 -0.232825 0.1761228 0.0103839 0.247173 -0.0164934 0.0056865 -0.0092636 0.0172199 -0.0692522 -0.1911791 0.0954982 0.0583357 0.2488317 -0.0034963 -0.0308054 0.0400683 0.0186502 -0.0960773 0.1224136 -0.0426627 -0.0514343 -0.0390876 0.0892435 -0.0036012 -0.0256309 -0.0070162 0.1269992 0.1545117 0.0655123 -0.0156823 0.016411 0.0690543 -0.0197043 0.0335722 0.0160113 0.1455481 0.0471762 0.03579 -0.0173114 0.0564679 0.0016402 -0.0284561 -0.0475458 -0.0204978 0.145895 0.0075036 -0.0414707 -0.056465 -0.0138193 0.0588644 -0.0392844 -0.0829169 -0.0414073 0.1303456 0.0954053 -0.0227613 -0.0125162 -0.0220679 0.0389706 -0.0109645 0.0084889 -0.0026056 0.1499483 0.0727707 -0.0020454 0.0009477 -0.0306691 -0.0222185 -0.0171378 -0.022785 -0.020365 0.1616915 -0.0118869 -0.0256327 -0.0186751 -0.0136678 0.0920948 -0.009865 -0.0051969 -0.0081698 0.1605751 unknown
polarizability: 406.9808045|-17.9979049|203.7639678|8.385738|-1.3678438|106.3935815 unknown
InChI: InChI=1S/C6H4BrO2S.C6H3Cl2O/c7-5-1-3-6(4-2-5)10(8)9;7-4-1-2-5(8)6(9)3-4/h1-4H;1-3H
charge 0 multiplicity 1
26 atoms
Br 6.361555 -0.976931 0.915271
Cl -0.95484 -2.531858 0.295342
Cl -5.656932 1.846962 0.421818
S  0.382059 1.052624 -0.93748
O  -0.644672 0.488797 0.756697
O  0.382381 2.67263 -1.026255
O  -0.177901 0.143229 -2.160656
C  2.076149 0.467904 -0.397654
C  -1.934253 0.086813 0.526725
C  2.41107 -0.878869 -0.612353
C  2.935956 1.408498 0.192116
C  3.699114 -1.306437 -0.222037
C  4.221417 0.971919 0.582713
C  -2.267463 -1.288191 0.321075
C  -2.989748 1.049128 0.543969
C  4.583002 -0.377406 0.37218
C  -4.313555 0.621573 0.384448
C  -3.603383 -1.69943 0.168283
C  -4.64112 -0.740313 0.196329
H  1.700523 -1.571205 -1.074012
H  2.623362 2.448189 0.328598
H  4.002813 -2.345193 -0.375507
H  4.923472 1.672606 1.041955
H  -2.732092 2.101482 0.692237
H  -3.839192 -2.75716 0.023017
H  -5.682328 -1.049559 0.072281
