program: Gaussian 09
title: 000216812
version: EM64L-G09RevD.01
frameworkgroup: C1[X(C11H14N3O2)]
method: RPBEPBE
basis: SDD
operation: Freq
keyword: #p
keyword: freq=noraman
keyword: PBEPBE/SDD
title: #p freq=noraman PBEPBE/SDD
converged: YES YES NO NO
title: Mulliken charges:
elementType: O O N N N C C C C C C C C C C C H H H H H H H H H H H H H H
charge: -0.168458 -0.246209 -0.016893 0.112545 -0.587411 -0.574895 -0.382598 0.494732 -0.386999 -0.368564 -0.236993 -0.337945 -0.336871 0.330660 0.358560 -0.534929 0.241631 0.270964 0.282251 0.264955 0.233577 0.234923 0.323356 0.268286 0.259196 0.389832 0.382453 0.235068 0.231028 0.264750
chargesum: 1.00000
title: Mulliken charges with hydrogens summed into heavy atoms:
elementType: O O N N N C C C C C C C C C C C
charge: -0.168458 -0.246209 -0.016893 0.112545 0.184874 -0.062300 0.164607 0.494732 -0.153422 -0.133641 0.086363 -0.069660 -0.077675 0.330660 0.358560 0.195917
polarizability: 3.04355143e+02 5.71289961e+00 1.51787213e+02 -1.23768769e+01 -8.50733564e+00 1.07674615e+02
1716.lowfreq: -4.7707 -0.0005 0.0007 0.0009 6.1267 14.0967 21.8642 37.1348 44.7070
frequency: 21.6556 36.9968 44.6218 74.6381 100.5225 124.5473 173.1323 217.0673 227.6237 262.9836 289.7507 337.9741 344.8587 359.1665 401.2808 412.1387 422.7651 456.0097 504.2844 543.0455 568.7407 595.7541 616.7906 629.2452 657.2368 690.1381 716.9905 727.2738 737.6897 794.4937 816.1401 821.2973 838.4810 899.3750 920.9047 930.7727 953.0740 967.6138 974.9474 999.0632 1001.9705 1009.6883 1025.8040 1090.8997 1110.2205 1116.5393 1150.5745 1156.6416 1184.1430 1204.2407 1220.9627 1252.1857 1284.1804 1303.2890 1314.6874 1335.1237 1366.0822 1384.8314 1414.7656 1432.8158 1437.5592 1461.6163 1467.7463 1469.2778 1471.5996 1503.2410 1568.0992 1614.8626 1619.7239 1684.0335 2978.2889 3001.6838 3050.1472 3064.3992 3074.8798 3117.9861 3120.7977 3124.4022 3145.5663 3170.8822 3174.2997 3272.7837 3529.7148 3666.5552
redmass: 5.5556 3.9070 6.0921 4.2079 4.2283 4.0592 3.4901 1.4691 2.2615 4.0958 2.5886 2.8302 5.0712 1.0686 3.9004 2.9572 2.7137 4.1639 3.9016 2.7027 5.2168 1.2851 3.9421 6.6697 2.4091 3.8717 5.4684 3.2107 1.8175 4.9270 2.9622 1.3626 2.0248 2.6863 4.4227 2.6165 1.4464 1.3764 7.8121 2.6696 2.3112 3.2886 1.8081 3.6551 1.2579 1.3752 1.2482 1.3013 1.2111 1.3593 1.8899 3.8810 1.7933 1.4944 1.3290 1.6337 2.3152 3.8492 2.8837 3.3832 1.2090 1.1116 1.0843 1.1344 1.0496 2.5349 6.6636 1.5557 2.8396 5.7356 1.0324 1.0607 1.0635 1.0983 1.1050 1.0902 1.0902 1.1078 1.1007 1.0938 1.0952 1.1022 1.0472 1.1048
irintensity: 2.4747 6.0720 2.5518 4.4977 3.6201 2.9343 6.8706 1.8519 1.4007 1.5940 9.2429 0.5670 2.0058 1.6830 14.3961 0.6480 4.6102 0.2094 35.8593 20.1874 14.4122 259.0365 91.9491 1.6180 33.6912 6.7027 7.0270 4.6689 32.9204 8.6582 12.0479 10.7149 97.5699 13.9534 11.6397 0.1425 1.5201 1.8105 63.7527 1.0689 6.4839 22.7703 7.2058 124.9611 0.2918 23.6502 13.7410 17.1612 103.6268 12.3127 4.9801 297.9382 25.2568 16.2700 29.8305 10.3059 80.4251 6.0045 27.8528 3.8179 16.8824 7.7562 65.6071 17.9990 18.5509 89.0273 17.5666 121.0086 198.3272 909.6100 64.3021 11.8614 3.7561 6.5619 31.7889 11.2549 6.7695 1.1805 13.0622 6.7201 2.8756 24.8600 404.2701 101.6046
temp: 298.150 k
press: 1.00000 atm
elementType: 8 8 7 7 7 6 6 6 6 6 6 6 6 6 6 6 1 1 1 1 1 1 1 1 1 1 1 1 1 1
symmnumber: 1
zpe: 630198.0 jmol-1
zpe.correction: 0.240030 hartree
zpe.thermalcorrener: 0.255094 hartree
zpe.thermalcorrenthalpy: 0.256038 hartree
zpe.thermalcorrgfe: 0.196211 hartree
zpe.sumelectzpe: -740.768582 hartree
zpe.sumelectthermal: -740.753518 hartree
zpe.sumelectthermalent: -740.752573 hartree
zpe.sumelectthermalfe: -740.812401 hartree
dipole: -9.5978 0.4229 0.6135
dipole: 9.6267
quadrupole: -17.7477 -66.4597 -88.2339
quadrupole: 9.8761 -17.2281 -4.6213
quadrupole: 39.7327 -8.9792 -30.7535 9.8761 -17.2281 -4.6213
hfenergy: -741.0086114 hartree
pointgroup: C01 [X(C11H14N3O2)]
dipole: -3.7628745 0.3415122 0.2623104 debye
polarizability: 304.4413416|-1.3774963|151.8082691|-13.622837|-7.2682657|107.5673602 unknown
InChI: InChI=1S/C11H14N3O2/c1-15-10-4-2-9(3-5-10)6-7-14-8-11(12)16-13-14/h2-5,8H,6-7,12H2,1H3
charge 1 multiplicity 1
30 atoms
O  -2.299905 -1.276159 -0.984968
O  3.763799 -1.527378 0.182751
N  -2.191313 0.869943 -0.503436
N  -1.558046 -0.052406 -1.278543
N  -4.096331 -2.011069 0.351969
C  -0.503906 2.280941 0.714789
C  -1.573095 2.213666 -0.43103
C  0.631406 1.293789 0.54881
C  0.704991 0.123058 1.357343
C  1.656099 1.513267 -0.408981
C  -3.231025 0.373667 0.261587
C  1.756734 -0.794465 1.213767
C  2.718275 0.60311 -0.57085
C  2.76962 -0.561455 0.24368
C  -3.305156 -0.994375 -0.046703
C  4.869191 -1.342566 -0.773432
H  -1.010634 2.145812 1.687848
H  -0.132399 3.322974 0.687262
H  -1.102624 2.400357 -1.409319
H  -2.380172 2.94713 -0.270318
H  -0.053248 -0.053124 2.131142
H  1.638117 2.417646 -1.030766
H  -3.825858 0.98854 0.927748
H  1.832391 -1.686675 1.841869
H  3.495553 0.806892 -1.312543
H  -3.961699 -2.948711 -0.029388
H  -4.845306 -1.863158 1.026969
H  5.431457 -0.416405 -0.552821
H  4.493801 -1.324481 -1.813466
H  5.517684 -2.216766 -0.625868
