program: Gaussian 09
title: 000216810
version: EM64L-G09RevD.01
frameworkgroup: C1[X(C10H12N3O2)]
method: RPBEPBE
basis: SDD
operation: Freq
keyword: #p
keyword: freq=noraman
keyword: PBEPBE/SDD
title: #p freq=noraman PBEPBE/SDD
converged: YES YES NO NO
title: Mulliken charges:
elementType: O O N N N C C C C C C C C C C H H H H H H H H H H H H
charge: -0.168466 -0.402086 -0.017785 0.115903 -0.585755 -0.570758 -0.381426 0.502326 -0.388038 -0.339277 -0.234355 -0.366882 -0.327265 0.357219 0.291039 0.241500 0.272178 0.285631 0.262064 0.234174 0.237557 0.323341 0.239055 0.273871 0.390414 0.383382 0.372440
chargesum: 1.00000
title: Mulliken charges with hydrogens summed into heavy atoms:
elementType: O O N N N C C C C C C C C C C
charge: -0.168466 -0.029645 -0.017785 0.115903 0.188041 -0.057080 0.166269 0.502326 -0.153865 -0.101720 0.088986 -0.127827 -0.053394 0.357219 0.291039
polarizability: 2.65597479e+02 -2.71277924e+00 1.41630509e+02 -1.48912191e+01 -7.84208855e+00 9.91455051e+01
1716.lowfreq: -15.2832 -1.1644 -0.0004 0.0001 0.0007 6.9405 22.7033 34.0788 39.2865
frequency: 22.5857 34.0376 39.2256 96.2473 105.3159 173.1262 256.3593 283.5346 317.5866 344.0035 361.7596 403.8269 407.2041 417.2145 419.4053 427.7793 470.6282 539.9121 567.2961 598.3573 618.3648 632.6318 658.5458 704.0367 716.5273 725.4078 738.6681 808.1242 817.0833 822.6804 838.9931 900.3474 921.2242 932.2932 946.8201 969.1375 998.8521 1003.8854 1009.8248 1026.1942 1091.2250 1106.5866 1139.1726 1152.8658 1184.3034 1204.1274 1220.7457 1270.3579 1285.6737 1304.2180 1324.9088 1338.1650 1366.1206 1396.8559 1415.0501 1435.9404 1460.3803 1469.4652 1506.9641 1579.8393 1615.4439 1622.6547 1684.9647 3000.1796 3050.8362 3063.7692 3118.2418 3122.7815 3124.6919 3142.4664 3180.4332 3272.9793 3528.5453 3577.2403 3665.0506
redmass: 5.9758 3.9169 6.8054 6.0134 4.1196 5.4066 5.2330 2.7833 2.6985 5.3015 1.0637 2.0565 2.9452 1.5971 2.7346 3.2476 4.0302 2.6510 5.1204 1.3114 3.7384 6.6185 2.3811 4.1344 5.5451 3.1596 1.8134 1.7007 5.3078 2.5732 1.7279 2.5709 4.4816 2.0019 1.7128 1.3610 2.5861 2.4490 3.6094 1.8099 3.4853 1.4859 1.3205 1.2274 1.1104 1.3987 1.8845 2.9346 1.8043 1.4979 1.3069 1.5891 2.2944 4.4906 2.9707 3.2891 1.1153 1.1257 2.7611 6.2377 1.3376 4.0315 5.7701 1.0610 1.0645 1.0964 1.0879 1.0906 1.1079 1.0969 1.0953 1.1022 1.0472 1.0664 1.1048
irintensity: 3.1850 0.7248 2.9206 6.5266 2.4726 1.4838 2.6699 6.9082 1.8094 0.3051 0.7144 38.5099 17.4593 100.9881 11.3992 5.5486 18.7825 27.6163 14.4353 239.9359 108.2689 1.3732 32.9792 5.5828 5.7459 10.3388 38.8121 9.1051 13.4187 28.0814 67.6672 8.4376 7.0924 0.0446 1.0968 0.4430 2.6241 9.8015 19.9220 8.0503 139.5599 58.5847 281.7563 3.1352 29.5227 5.2341 13.9206 81.7853 20.2406 32.6191 9.8015 4.7271 66.9942 40.6791 28.4894 3.7671 9.2397 26.2567 64.5792 17.9518 56.7432 238.1815 875.8151 10.7965 3.6596 7.0346 7.1883 10.3438 1.1401 9.5354 1.7396 25.0218 399.1704 126.1803 102.5605
temp: 298.150 k
press: 1.00000 atm
elementType: 8 8 7 7 7 6 6 6 6 6 6 6 6 6 6 1 1 1 1 1 1 1 1 1 1 1 1
symmnumber: 1
zpe: 556851.4 jmol-1
zpe.correction: 0.212094 hartree
zpe.thermalcorrener: 0.225674 hartree
zpe.thermalcorrenthalpy: 0.226618 hartree
zpe.thermalcorrgfe: 0.170031 hartree
zpe.sumelectzpe: -701.555174 hartree
zpe.sumelectthermal: -701.541594 hartree
zpe.sumelectthermalent: -701.540650 hartree
zpe.sumelectthermalfe: -701.597237 hartree
dipole: -10.3348 -0.2660 3.2538
dipole: 10.8382
quadrupole: -31.7093 -55.6575 -82.3947
quadrupole: 3.9173 -5.9222 -7.3625
quadrupole: 24.8779 0.9297 -25.8076 3.9173 -5.9222 -7.3625
hfenergy: -701.7672677 hartree
pointgroup: C01 [X(C10H12N3O2)]
dipole: 4.0617588 -0.0955643 1.294297 debye
polarizability: 264.9352329|-8.7558031|142.1447044|15.8173496|7.1956505|99.2935558 unknown
InChI: InChI=1S/C10H12N3O2/c11-10-7-13(12-15-10)6-5-8-1-3-9(14)4-2-8/h1-4,7,14H,5-6,11H2
charge 1 multiplicity 1
27 atoms
O  2.257797 1.167351 -0.922671
O  -4.059862 1.905171 -0.364701
N  1.841136 -0.926507 -0.385825
N  1.341243 0.058365 -1.179814
N  4.162921 1.659529 0.375691
C  -0.067397 -2.055589 0.803324
C  1.049338 -2.176496 -0.288566
C  -1.09944 -0.988117 0.506118
C  -1.159956 0.204775 1.273902
C  -2.048939 -1.167639 -0.540464
C  2.952211 -0.571157 0.356656
C  -2.132845 1.191585 1.015603
C  -3.019952 -0.193706 -0.816009
C  3.223961 0.763048 0.011761
C  -3.063494 0.991609 -0.035817
H  0.406231 -1.892036 1.78855
H  -0.534256 -3.058776 0.834985
H  0.603389 -2.351745 -1.280354
H  1.74981 -2.99525 -0.056749
H  -0.461283 0.353664 2.106781
H  -2.042231 -2.089388 -1.135993
H  3.459361 -1.251894 1.031312
H  -2.175533 2.098411 1.631167
H  -3.758468 -0.326538 -1.611303
H  4.17064 2.594276 -0.035533
H  4.889713 1.41813 1.048176
H  -4.059892 2.697727 0.228671
