program: Gaussian 09
title: 000216814
version: EM64L-G09RevD.01
frameworkgroup: C1[X(C12H16N3O3)]
method: RPBEPBE
basis: SDD
operation: Freq
keyword: #p
keyword: freq=noraman
keyword: PBEPBE/SDD
title: #p freq=noraman PBEPBE/SDD
converged: YES YES NO NO
title: Mulliken charges:
elementType: O O O N N N C C C C C C C C C C C C H H H H H H H H H H H H H H H H
charge: -0.289058 -0.167054 -0.272511 -0.016601 0.110095 -0.587497 -0.577535 -0.383796 0.543260 -0.536071 -0.416558 0.228973 0.225453 -0.318710 -0.234234 0.363693 -0.501481 -0.533069 0.241170 0.270093 0.280162 0.270180 0.256245 0.239311 0.256145 0.323187 0.227005 0.259031 0.237967 0.381696 0.389509 0.236117 0.235051 0.259833
chargesum: 1.00000
title: Mulliken charges with hydrogens summed into heavy atoms:
elementType: O O O N N N C C C C C C C C C C C C
charge: -0.289058 -0.167054 -0.272511 -0.016601 0.110095 0.183708 -0.066272 0.166547 0.543260 -0.279826 -0.177247 0.228973 0.225453 -0.062565 0.088952 0.363693 0.222522 0.197932
polarizability: 3.12098352e+02 -1.59716384e+01 1.88888891e+02 9.72571032e+00 -2.34240869e+00 1.24898081e+02
1716.lowfreq: -9.7496 -3.9693 -0.0007 -0.0006 -0.0004 2.5111 18.7665 22.6028 44.5464
frequency: 18.7317 22.4839 44.5392 51.0628 68.7434 91.9871 115.4455 118.6328 159.4257 196.7110 211.4073 223.0496 252.7133 274.3908 294.4196 326.0786 342.1387 355.0265 361.3573 416.3188 428.4529 453.4048 472.6320 493.6099 569.4113 591.7941 596.5774 614.5944 632.1847 655.3351 694.7590 712.1969 718.7233 728.7556 737.7515 805.2653 822.9534 849.8053 877.1233 906.9662 925.1117 931.5337 934.1100 970.0897 991.3637 1007.0904 1017.9441 1026.5223 1089.3460 1107.7508 1109.5732 1116.5260 1141.5545 1150.6415 1155.3563 1180.1117 1205.9633 1218.0596 1259.5069 1274.7134 1284.4315 1307.6631 1334.8977 1365.2919 1385.1772 1409.0757 1415.3294 1434.7082 1445.6583 1455.7638 1461.8172 1467.1470 1468.4892 1468.9789 1469.3817 1498.7020 1565.9049 1609.1130 1616.5653 1683.9061 2977.7191 3000.5708 3003.4388 3048.5773 3065.5129 3074.9227 3113.2640 3123.1375 3131.2849 3136.5466 3142.1641 3143.4382 3171.7823 3273.7619 3530.4531 3667.7198
redmass: 5.6649 4.7113 6.1722 2.0642 4.0383 4.4925 3.3404 1.9106 2.5292 3.5363 2.9055 1.2398 3.2756 4.1917 2.5719 3.5357 3.3886 1.3245 2.7969 2.9479 3.5742 4.6308 3.7891 4.4150 5.1847 1.7458 2.4872 4.5426 3.7051 2.3537 4.4157 4.9985 4.8800 3.4483 1.8605 1.4733 4.7601 4.6781 1.6399 2.5731 3.8696 2.0274 1.9790 7.4169 2.6013 3.9219 2.4373 1.8272 3.7058 1.2644 1.2574 1.9561 1.4021 1.3209 1.4387 1.5000 1.3015 1.9448 2.5497 1.9943 1.7157 1.5000 1.6482 2.4238 5.1466 2.5026 2.6919 1.1905 1.3677 1.0680 1.1345 1.0500 1.0955 1.0534 1.1681 2.7029 6.9048 5.6890 1.2351 5.6397 1.0321 1.0316 1.0603 1.0616 1.1005 1.1051 1.1012 1.1077 1.0900 1.0915 1.1009 1.1060 1.0938 1.1021 1.0471 1.1048
irintensity: 2.5273 1.9504 6.0017 6.4453 4.7787 6.4510 3.7589 1.8280 4.2069 1.5118 2.7002 0.1991 2.9543 0.4316 8.9066 6.1647 1.1731 3.4888 0.2724 7.2015 24.6299 8.2652 1.8166 4.3242 9.1325 188.3350 66.7036 96.4550 9.5101 24.2006 5.0262 4.2286 7.8731 8.0717 27.2859 25.5752 61.5647 10.8132 27.5277 11.8016 15.3382 16.3714 3.0733 73.7609 20.0031 42.8779 18.8847 5.6931 136.7679 2.8236 0.5626 83.2046 23.6544 3.8992 22.9965 12.0669 27.0148 36.1826 377.2973 123.8118 29.6891 18.0914 10.0277 104.3110 29.2095 9.4291 30.0701 5.4980 24.9359 12.5662 11.4930 23.8026 91.0502 17.7462 22.9055 181.5154 89.2590 124.2501 9.1659 905.8202 65.4784 65.7136 12.9338 3.4397 6.7117 28.6408 26.2007 0.9963 7.5887 3.0203 11.4216 12.3366 8.8355 24.3496 384.1273 100.1857
temp: 298.150 k
press: 1.00000 atm
elementType: 8 8 8 7 7 7 6 6 6 6 6 6 6 6 6 6 6 6 1 1 1 1 1 1 1 1 1 1 1 1 1 1 1 1
symmnumber: 1
zpe: 711013.2 jmol-1
zpe.correction: 0.270811 hartree
zpe.thermalcorrener: 0.288943 hartree
zpe.thermalcorrenthalpy: 0.289887 hartree
zpe.thermalcorrgfe: 0.222544 hartree
zpe.sumelectzpe: -855.115911 hartree
zpe.sumelectthermal: -855.097779 hartree
zpe.sumelectthermalent: -855.096835 hartree
zpe.sumelectthermalfe: -855.164178 hartree
dipole: -8.2205 0.9509 -0.9167
dipole: 8.3259
quadrupole: -31.1305 -68.7945 -97.8074
quadrupole: -12.7579 12.8447 0.0185
quadrupole: 34.7803 -2.8837 -31.8966 -12.7579 12.8447 0.0185
hfenergy: -855.3867215 hartree
pointgroup: C01 [X(C12H16N3O3)]
dipole: 3.2500313 -0.3479193 0.2151271 debye
polarizability: 313.5238941|-11.9148246|187.9199178|1.705417|1.9626144|124.4415126 unknown
InChI: InChI=1S/C12H16N3O3/c1-16-10-4-3-9(7-11(10)17-2)5-6-15-8-12(13)18-14-15/h3-4,7-8H,5-6,13H2,1-2H3
charge 1 multiplicity 1
34 atoms
O  -1.088744 2.18516 1.125468
O  2.556114 0.502513 -1.629617
O  -3.262434 1.248087 -0.520629
N  2.523817 -1.299077 -0.364542
N  1.938733 -0.812588 -1.49298
N  4.112737 1.879336 -0.519525
C  0.909039 -2.29093 1.285567
C  1.975428 -2.567655 0.169862
C  -0.223549 -1.395309 0.828693
C  -0.233608 -0.023057 1.180651
C  -1.285708 -1.899253 0.035599
C  -1.253629 0.852984 0.751246
C  -2.308373 0.334775 -0.074944
C  -2.315627 -1.044506 -0.403951
C  3.426321 -0.444189 0.238151
C  3.449607 0.706669 -0.566752
C  -2.261768 3.03962 1.435528
C  -4.360241 0.753636 -1.368906
H  1.416858 -1.86648 2.17065
H  0.535628 -3.291212 1.574963
H  1.519559 -3.093374 -0.684122
H  2.815843 -3.165692 0.559342
H  0.53701 0.402563 1.83407
H  -1.321616 -2.961692 -0.232672
H  -3.123089 -1.453673 -1.017409
H  3.96682 -0.691936 1.144781
H  -2.944846 2.521761 2.132128
H  -2.800741 3.315093 0.517515
H  -1.828286 3.926708 1.920627
H  4.768385 2.084709 0.232933
H  3.952562 2.590043 -1.234957
H  -4.972167 0.007176 -0.8296
H  -3.967917 0.321445 -2.30798
H  -4.966317 1.642646 -1.591588
