program: Gaussian 09
title: 000211596
version: EM64L-G09RevD.01
frameworkgroup: C1[X(C12H15NO2)]
method: RPBEPBE
basis: SDD
operation: Freq
keyword: #p
keyword: freq=noraman
keyword: PBEPBE/SDD
title: #p freq=noraman PBEPBE/SDD
converged: YES YES NO NO
title: Mulliken charges:
elementType: O O N C C C C C C C C C C C C H H H H H H H H H H H H H H H
charge: -0.442973 -0.286360 -0.425633 -0.085059 -0.452325 -0.303529 0.443226 -0.392165 -0.437847 -0.227290 -0.193146 -0.276836 -0.314184 0.185353 -0.453148 0.235223 0.235319 0.253177 0.220387 0.203298 0.298929 0.261797 0.215045 0.353095 0.221323 0.220335 0.225980 0.216297 0.224382 0.277331
chargesum: 0.00000
title: Mulliken charges with hydrogens summed into heavy atoms:
elementType: O O N C C C C C C C C C C C C
charge: -0.089878 -0.286360 -0.126704 0.150164 0.036170 0.120156 0.443226 -0.130368 -0.222802 -0.005966 0.027189 -0.050856 0.126494 0.185353 -0.175817
polarizability: 1.96688384e+02 -9.95074345e+00 1.37759426e+02 2.12513896e+01 3.87567802e+00 9.22619292e+01
1716.lowfreq: -7.4247 -0.0009 -0.0006 -0.0004 2.9308 11.7096 13.9672 32.3119 55.9573
frequency: 11.5433 31.7097 55.8453 62.5026 86.2296 88.6227 130.8236 178.3717 194.5656 219.7405 262.5446 317.3439 319.0642 372.2178 395.5049 404.6229 427.6894 434.4629 493.7334 509.2347 543.2461 555.2426 612.9364 635.2371 649.3522 679.3409 695.9771 752.3694 766.5567 812.2644 823.2578 874.9775 902.9303 922.8551 956.5210 958.0562 974.9116 975.8058 979.3006 1000.7973 1013.6801 1026.8001 1034.2268 1077.1014 1118.8876 1138.3714 1169.4630 1181.8523 1192.3046 1201.4263 1223.8920 1261.7352 1291.4196 1315.7382 1328.9305 1343.2171 1360.9010 1367.3723 1384.2871 1395.7623 1432.9744 1454.9067 1460.4317 1473.0822 1482.2092 1508.6341 1587.7270 1622.8987 2153.2155 2921.8919 2932.6816 2965.5619 2999.6015 3007.2872 3059.9195 3071.7757 3107.7501 3124.7374 3136.7701 3152.5300 3166.9869 3425.2095 3523.1925 3565.0583
redmass: 5.5313 4.0383 3.8621 3.6509 4.4191 4.2797 4.3635 3.2035 4.8189 4.5123 4.1627 3.1947 3.5117 4.1207 2.0701 3.1965 1.8347 1.8906 1.1547 2.5615 6.2309 4.0934 6.0572 1.2297 2.7121 1.2533 1.9093 1.7557 4.0053 3.4308 1.2966 1.4527 4.7341 3.4677 1.3743 3.6501 1.4133 3.6095 1.7674 1.7035 2.9205 3.8093 2.7537 1.8152 2.0753 2.4397 1.0510 1.1381 1.1147 1.0844 1.4025 1.1757 1.8558 1.2721 1.4399 1.3375 1.2970 1.2103 4.0153 1.4664 2.1135 1.1350 1.0915 1.0916 1.7801 2.4608 5.0679 6.1659 6.0112 1.0551 1.0582 1.1036 1.1019 1.0609 1.0884 1.1026 1.0874 1.0860 1.0927 1.0934 1.1007 1.1607 1.0660 1.0766
irintensity: 0.1524 0.3434 0.1151 0.3834 3.2409 7.2257 7.3253 5.1206 2.2049 5.4862 7.4923 4.6609 0.9366 1.6324 31.4434 35.6527 60.4774 34.0801 202.5471 12.5883 6.6456 3.9716 0.4173 74.7085 2.1481 59.8109 28.9308 84.2200 13.2189 16.2758 1.0190 6.1768 13.9496 14.2324 0.4517 5.5025 1.9147 1.6285 11.3448 43.9918 13.1289 117.6333 109.1943 15.0955 21.4773 7.0422 0.6802 4.2155 13.7525 0.6833 21.6844 6.6864 49.9138 23.4334 41.6313 10.6092 8.3174 14.9587 28.1620 17.8146 12.2984 13.0761 11.8104 14.1432 7.3429 209.8811 10.4294 211.0087 0.9703 32.5379 69.5499 39.9995 40.6513 25.7096 55.7251 17.8177 15.6355 3.6649 29.4423 27.5513 15.4719 62.0178 18.8426 31.0965
temp: 298.150 k
press: 1.00000 atm
elementType: 8 8 7 6 6 6 6 6 6 6 6 6 6 6 6 1 1 1 1 1 1 1 1 1 1 1 1 1 1 1
symmnumber: 1
zpe: 639001.5 jmol-1
zpe.correction: 0.243383 hartree
zpe.thermalcorrener: 0.258924 hartree
zpe.thermalcorrenthalpy: 0.259868 hartree
zpe.thermalcorrgfe: 0.198044 hartree
zpe.sumelectzpe: -670.249195 hartree
zpe.sumelectthermal: -670.233654 hartree
zpe.sumelectthermalent: -670.232710 hartree
zpe.sumelectthermalfe: -670.294533 hartree
dipole: 2.0785 -1.5366 -0.9375
dipole: 2.7496
quadrupole: -83.9038 -89.9188 -88.5021
quadrupole: -2.4521 -0.9997 2.1776
quadrupole: 3.5377 -2.4772 -1.0605 -2.4521 -0.9997 2.1776
hfenergy: -670.4925777 hartree
pointgroup: C01 [X(C12H15N1O2)]
dipole: 0.7469395 -0.4761696 -0.6209304 debye
polarizability: 195.2436191|-21.5121131|131.2354597|11.5614913|19.0483959|100.2306608 unknown
InChI: InChI=1S/C12H15NO2/c1-2-8-15-10-12(14)9-13-11-6-4-3-5-7-11/h1,3-7,12-14H,8-10H2
charge 0 multiplicity 1
30 atoms
O  0.071461 2.606668 0.474601
O  2.79767 0.130804 -0.059973
N  -0.413245 -0.457543 0.390799
C  1.042298 1.558536 0.834642
C  0.36654 0.280372 1.388047
C  1.924429 1.270221 -0.39434
C  -1.790981 -0.331528 0.157935
C  -2.588159 0.676071 0.781843
C  -2.428961 -1.241252 -0.740278
C  -3.972331 0.752325 0.512599
C  -3.808091 -1.1440 -1.00416
C  -4.597693 -0.14714 -0.380108
C  3.790774 -0.118275 -1.122355
C  4.577818 -1.312039 -0.792873
C  5.259119 -2.309319 -0.549712
H  1.649819 2.012214 1.63684
H  -0.276699 0.562556 2.241707
H  1.164531 -0.379992 1.770515
H  2.522475 2.171109 -0.644339
H  1.282577 1.014163 -1.266997
H  0.072727 -1.214374 -0.089882
H  -2.137572 1.391369 1.477052
H  -1.833022 -2.02691 -1.223106
H  -0.611237 2.213348 -0.130514
H  -4.564472 1.532523 1.005444
H  -4.271378 -1.855041 -1.698309
H  -5.670472 -0.075331 -0.585721
H  3.274605 -0.264319 -2.097597
H  4.461774 0.762937 -1.223439
H  5.850695 -3.179151 -0.327722
