program: Gaussian 09
title: 000211595
version: EM64L-G09RevD.01
frameworkgroup: C1[X(C12H18N2O2)]
method: RPBEPBE
basis: SDD
operation: Freq
keyword: #p
keyword: freq=noraman
keyword: PBEPBE/SDD
title: #p freq=noraman PBEPBE/SDD
converged: YES YES NO NO
title: Mulliken charges:
elementType: O O N N C C C C C C C C C C C C H H H H H H H H H H H H H H H H H H
charge: -0.226885 -0.241127 -0.100240 -0.352204 -0.363808 -0.439056 -0.329645 -0.328935 -0.668601 -0.666504 0.362363 0.021578 -0.477281 0.166997 -0.237867 -0.267371 0.236480 0.214323 0.252483 0.227451 0.209119 0.196074 0.204190 0.200804 0.331836 0.206109 0.228338 0.211971 0.208601 0.225476 0.213654 0.257519 0.261630 0.262530
chargesum: 0.00000
title: Mulliken charges with hydrogens summed into heavy atoms:
elementType: O O N N C C C C C C C C C C C C
charge: -0.226885 -0.241127 -0.100240 -0.020368 0.086995 0.040878 0.075548 0.076059 -0.022183 -0.018773 0.362363 0.021578 -0.219763 0.166997 0.023763 -0.004841
polarizability: 2.88437031e+02 1.60753062e+01 1.89447817e+02 -7.97669653e+00 -8.22526974e+00 9.59272228e+01
1716.lowfreq: -7.3339 -0.0004 0.0005 0.0007 2.9143 9.4818 25.8446 31.1948 42.4816
frequency: 25.5295 30.9064 42.4691 62.3230 69.8234 86.0427 101.0338 145.6723 161.4523 200.2849 213.7281 247.0944 263.0058 286.5412 295.2154 307.6649 378.3674 397.0900 409.5535 438.2634 454.4807 458.3241 496.0066 536.4532 590.0687 619.3721 672.7485 687.1383 746.2505 765.1736 770.2741 789.6737 792.6752 799.4471 821.3419 860.7357 899.3790 918.5590 988.2484 990.3869 1009.9371 1036.9039 1067.3982 1073.0128 1076.1358 1085.0330 1102.9299 1122.9991 1175.2094 1207.2064 1212.4239 1249.2759 1250.9254 1280.7316 1290.9174 1299.9196 1315.9527 1319.5538 1326.0975 1357.8458 1363.8576 1364.7984 1373.8923 1388.7193 1389.8559 1460.7059 1463.0035 1468.0722 1470.7762 1479.1069 1485.1149 1486.4468 1490.1013 1500.5030 1514.7427 1559.6023 1594.5873 1639.6585 2866.7706 2874.0884 2911.3761 2982.3705 2985.3938 3005.0433 3016.9751 3037.0122 3043.1699 3074.8446 3078.6940 3083.2952 3092.0851 3092.5130 3142.1964 3158.2601 3168.7001 3460.4010
redmass: 4.1174 4.6936 3.6138 2.5245 3.2142 2.1192 7.2180 1.9397 4.3716 1.9698 1.4175 1.9661 2.6745 2.5491 2.8582 2.9496 2.8804 5.8860 4.9320 5.1321 3.2804 3.0250 3.4058 4.7532 4.0661 3.1682 1.1485 4.3107 2.5798 2.1920 2.0017 1.4673 1.4827 1.2234 2.2669 1.8404 2.6935 1.9635 1.3003 2.4633 3.7311 3.2478 1.9165 2.5670 1.8124 2.1924 1.5029 1.6870 1.5808 2.0323 2.1078 2.0366 1.5256 1.1710 1.2449 1.2361 1.6430 1.6857 1.9639 1.3123 1.9419 1.6808 1.3379 1.2327 1.2316 1.0661 1.0544 1.0663 1.0737 1.0574 1.0659 1.0946 1.0766 2.2247 5.1208 6.2896 7.7031 7.4390 1.0718 1.0712 1.0696 1.0357 1.0357 1.0628 1.0880 1.0879 1.0902 1.0984 1.0985 1.1030 1.1005 1.1004 1.0867 1.0914 1.1006 1.0762
irintensity: 0.6642 0.6360 0.2232 1.2741 0.9528 0.2310 9.3609 3.9707 0.1639 3.1162 0.2679 0.0686 1.8891 3.4087 1.6911 3.2115 21.5744 2.4003 37.5916 1.4515 10.4140 4.4920 3.6531 2.2392 0.1073 17.6796 97.5696 13.6392 12.0369 1.0396 4.6043 15.7126 5.5589 16.1001 1.9475 83.2210 3.1441 0.8602 0.0943 3.3578 25.5819 49.0102 47.6649 54.7893 39.0880 2.6121 18.0330 54.0340 22.3418 27.6795 41.0885 17.9665 3.8502 20.0947 46.1936 12.3367 9.3249 56.4623 13.8092 32.4894 1.0171 9.8150 15.3085 31.9946 25.1923 7.0008 11.6057 9.0464 10.9214 4.9080 17.7223 33.7439 6.5592 78.3852 215.3242 212.8557 109.9768 100.0196 45.5204 162.2970 42.6750 34.7721 39.3814 35.4603 16.4704 14.0148 19.4717 62.1532 53.5117 26.3530 20.9469 58.7229 1.7422 6.8359 12.1581 78.8353
temp: 298.150 k
press: 1.00000 atm
elementType: 8 8 7 7 6 6 6 6 6 6 6 6 6 6 6 6 1 1 1 1 1 1 1 1 1 1 1 1 1 1 1 1 1 1
symmnumber: 1
zpe: 743155.8 jmol-1
zpe.correction: 0.283053 hartree
zpe.thermalcorrener: 0.300232 hartree
zpe.thermalcorrenthalpy: 0.301176 hartree
zpe.thermalcorrgfe: 0.236152 hartree
zpe.sumelectzpe: -726.758879 hartree
zpe.sumelectthermal: -726.741700 hartree
zpe.sumelectthermalent: -726.740756 hartree
zpe.sumelectthermalfe: -726.805779 hartree
dipole: -3.5070 -2.0702 -0.2090
dipole: 4.0778
quadrupole: -90.1949 -112.5124 -97.2460
quadrupole: -4.5686 0.9813 1.4530
quadrupole: 9.7896 -12.5280 2.7384 -4.5686 0.9813 1.4530
hfenergy: -727.0419317 hartree
pointgroup: C01 [X(C12H18N2O2)]
dipole: -1.3941683 0.74667 -0.269494 debye
polarizability: 287.8566519|-7.2478708|170.7040672|20.383375|-37.7332255|115.2513508 unknown
InChI: InChI=1S/C12H18N2O2/c1-3-14(4-2)8-7-13-11-9-10(15)5-6-12(11)16/h5-6,9,13H,3-4,7-8H2,1-2H3
charge 0 multiplicity 1
34 atoms
O  2.533639 2.439626 -1.004873
O  2.726013 -2.421727 1.495944
N  -3.189321 -0.12482 0.079469
N  0.287287 0.968286 -1.011427
C  -1.911411 0.606718 0.175401
C  -1.040804 0.358908 -1.095342
C  -4.374695 0.63973 0.547649
C  -3.115176 -1.515289 0.603777
C  -4.79704 1.750174 -0.433152
C  -4.111567 -2.47444 -0.074726
C  1.365392 0.422213 -0.36645
C  2.596716 1.307564 -0.422132
C  1.413368 -0.812676 0.276517
C  2.637873 -1.289661 0.894286
C  3.832003 0.809381 0.209924
C  3.853965 -0.4105 0.826655
H  -1.325009 0.320941 1.079165
H  -2.108938 1.690759 0.256178
H  -1.572504 0.769825 -1.970087
H  -0.935455 -0.729843 -1.261063
H  -5.21228 -0.073305 0.651407
H  -4.203848 1.076307 1.563336
H  -2.089291 -1.889406 0.423041
H  -3.26294 -1.537246 1.712258
H  0.456853 1.898589 -1.414082
H  -3.998648 2.502073 -0.57417
H  -5.03518 1.31605 -1.419732
H  -5.689831 2.281207 -0.053758
H  -5.159461 -2.165494 0.090407
H  -3.933384 -2.503117 -1.163735
H  -3.997453 -3.496583 0.331418
H  0.541404 -1.469946 0.346045
H  4.706943 1.465711 0.153325
H  4.755681 -0.81041 1.305225
