program: Gaussian 09
title: 000211594
version: EM64L-G09RevD.01
frameworkgroup: C1[X(C15H20N4S)]
method: RPBEPBE
basis: SDD
operation: Freq
keyword: #p
keyword: freq=noraman
keyword: PBEPBE/SDD
title: #p freq=noraman PBEPBE/SDD
converged: YES YES NO NO
title: Mulliken charges:
elementType: S N N N N C C C C C C C C C C C C C C C H H H H H H H H H H H H H H H H H H H H
charge: 0.235535 -0.075594 -0.147989 -0.108070 -0.005486 -0.330669 -0.363999 -0.386134 -0.392231 -0.328306 -0.498613 0.245840 -0.257254 -0.322180 0.246523 -0.180154 -0.346558 -0.755613 -0.463438 -0.219557 0.200577 0.188887 0.192516 0.213781 0.199580 0.220869 0.209446 0.272819 0.195526 0.222671 0.217276 0.242889 0.214362 0.228832 0.231714 0.246533 0.215662 0.246620 0.265784 0.227604
chargesum: 0.00000
title: Mulliken charges with hydrogens summed into heavy atoms:
elementType: S N N N N C C C C C C C C C C C C C C C
charge: 0.235535 -0.075594 -0.147989 -0.108070 -0.005486 0.058795 0.042298 0.034315 0.090034 0.089891 -0.038448 0.245840 -0.257254 -0.107818 0.246523 0.048678 -0.114843 -0.046799 -0.197653 0.008047
polarizability: 3.03355945e+02 1.08987220e+01 1.92738747e+02 -5.40002838e+00 2.28486146e+00 1.28546672e+02
1716.lowfreq: -4.8367 -0.0023 -0.0021 -0.0016 0.3563 8.1208 12.8511 14.7684 25.8949
frequency: 12.7705 14.6133 25.5862 51.1953 55.1393 60.8714 99.8765 107.1720 143.9591 160.3523 175.9062 213.3330 254.0129 264.9615 281.2849 310.5917 329.5551 371.9453 381.1044 402.0429 409.5630 468.6161 471.0284 505.9329 509.4286 512.5154 550.3855 602.3819 611.6581 624.0570 641.5380 677.0453 726.7879 730.0181 744.4581 760.2626 767.8056 774.2045 787.4149 840.4149 846.2439 871.0577 926.4287 941.1905 943.1734 953.6655 970.6239 976.1042 997.7706 1031.6889 1042.3528 1044.1658 1049.8729 1056.1516 1072.2382 1090.9557 1101.5682 1130.8923 1144.3558 1156.6992 1170.6004 1187.4254 1199.6713 1221.9012 1223.6732 1246.3953 1259.4952 1282.3806 1291.4149 1297.8457 1301.1757 1305.7428 1328.4994 1334.1025 1345.3679 1361.5699 1366.2000 1387.0130 1392.6993 1400.4654 1425.5193 1444.6203 1454.0610 1455.5080 1459.2781 1461.7655 1462.2451 1467.2205 1474.4559 1482.2780 1487.5520 1551.7396 1558.3957 1598.5331 2848.4689 2859.1791 2873.8416 2948.0268 2955.0399 2991.4326 3003.1165 3026.0593 3035.5895 3040.1286 3063.7834 3072.3952 3090.8949 3096.7559 3104.4753 3118.7744 3134.5129 3164.8393 3176.7790 3222.9358
redmass: 4.4497 5.1581 4.6206 4.2366 3.3930 3.6576 2.7710 1.3073 5.0505 3.4025 3.8014 2.9046 2.1688 2.9322 2.5397 2.6503 3.9872 3.3347 3.7196 2.1271 3.4325 2.9783 3.5712 4.7979 2.8047 6.4840 5.7671 4.4909 5.1477 3.4193 5.4386 3.7182 1.7057 4.4606 3.3029 1.2885 2.5054 2.4445 1.9723 1.5642 1.3975 2.8724 3.7166 2.6940 1.4394 3.8721 1.6907 1.3220 2.7928 2.7760 2.3248 1.6344 1.9041 2.0653 2.0052 1.7597 2.1755 2.5667 2.7752 2.7650 1.1249 2.0263 1.0937 1.3710 1.6626 1.4729 1.3126 1.3430 1.2764 1.5848 2.0347 2.8476 1.4574 1.9275 1.5670 1.3940 1.3087 1.4672 2.0198 1.2835 2.1536 7.4911 1.0958 1.1135 1.0592 1.1002 1.1168 1.1435 1.1100 1.0994 2.7892 5.2369 5.6509 6.0591 1.0712 1.0702 1.0696 1.0697 1.0692 1.0369 1.0599 1.0884 1.0891 1.0893 1.1016 1.0983 1.0906 1.0924 1.0984 1.0893 1.0885 1.0924 1.1001 1.0959
irintensity: 0.2206 0.0947 0.3570 1.1822 0.1522 0.2287 0.5643 0.3947 2.2539 2.3438 0.9227 5.6362 4.2685 2.1861 0.8718 9.6149 3.0865 5.6879 6.7849 3.0160 3.5657 1.7143 5.9009 4.7041 8.0682 3.9738 3.7959 3.3244 13.4041 3.2321 2.0957 1.5551 32.6036 0.9888 10.4287 43.2832 65.0277 4.6126 6.3237 1.0232 0.0019 12.6336 7.4922 1.4063 0.7061 70.7317 3.3053 0.1853 56.2130 25.1772 4.4704 3.7302 4.8640 15.6990 1.6228 0.4429 7.8239 83.6648 24.4930 10.9199 5.1222 1.1134 0.9019 5.8832 8.4104 135.3834 40.1110 0.9145 20.1467 19.4960 13.4028 0.7119 9.7428 55.3765 12.2862 1.3610 22.3754 2.2411 0.9645 20.7114 31.8103 55.0666 8.1786 50.2752 21.5312 36.7027 11.7873 28.0951 6.9658 19.9978 208.4814 44.2433 11.6188 399.0889 44.6991 39.1570 138.6116 47.6863 89.5464 22.2351 17.8110 6.9000 48.7875 58.1202 23.8182 14.3283 21.3515 10.4988 25.5660 31.3459 11.8074 34.7114 15.2113 0.0680
temp: 298.150 k
press: 1.00000 atm
elementType: 16 7 7 7 7 6 6 6 6 6 6 6 6 6 6 6 6 6 6 6 1 1 1 1 1 1 1 1 1 1 1 1 1 1 1 1 1 1 1 1
symmnumber: 1
zpe: 863062.8 jmol-1
zpe.correction: 0.328723 hartree
zpe.thermalcorrener: 0.347878 hartree
zpe.thermalcorrenthalpy: 0.348822 hartree
zpe.thermalcorrgfe: 0.277163 hartree
zpe.sumelectzpe: -1199.139870 hartree
zpe.sumelectthermal: -1199.120716 hartree
zpe.sumelectthermalent: -1199.119772 hartree
zpe.sumelectthermalfe: -1199.191431 hartree
dipole: 0.7719 1.5887 0.7090
dipole: 1.9033
quadrupole: -139.0867 -120.1405 -130.3338
quadrupole: 11.7741 -1.1715 3.9631
quadrupole: -9.2330 9.7132 -0.4801 11.7741 -1.1715 3.9631
hfenergy: -1199.4685935 hartree
pointgroup: C01 [X(C15H20N4S1)]
dipole: 0.287989 0.6107201 0.3237643 debye
polarizability: 302.671842|14.1999306|192.731944|-4.9559593|6.8201911|129.2375781 unknown
InChI: InChI=1S/C15H20N4S/c1-13-14(20-12-17-13)5-7-18-8-10-19(11-9-18)15-4-2-3-6-16-15/h2-4,6,12H,5,7-11H2,1H3
charge 0 multiplicity 1
40 atoms
S  -5.157176 -1.677005 0.255944
N  -0.431509 -0.558132 0.227741
N  2.433802 -0.223035 0.333281
N  4.458637 -0.968211 -0.606945
N  -6.347292 0.494599 -0.715356
C  0.172169 0.787598 0.379293
C  0.468559 -1.429606 -0.5755
C  1.551949 0.697183 1.066205
C  1.841188 -1.557243 0.105254
C  -1.811831 -0.522311 -0.308326
C  -2.84171 -0.029542 0.747122
C  3.779612 0.026678 0.061652
C  -4.260208 -0.095814 0.246177
C  4.441291 1.243638 0.437258
C  -5.058683 0.904118 -0.305179
C  5.791896 1.418222 0.089752
C  5.765489 -0.771215 -0.92531
C  -4.683971 2.351275 -0.501029
C  -6.558097 -0.787446 -0.501409
C  6.486166 0.400616 -0.611618
H  -0.486297 1.419103 1.002613
H  0.295294 1.29198 -0.614074
H  0.610224 -1.03076 -1.611634
H  0.009283 -2.432313 -0.65332
H  1.989533 1.706717 1.103843
H  1.408828 0.340776 2.109255
H  1.709837 -2.074403 1.079817
H  2.544768 -2.134588 -0.513278
H  -1.895487 0.113216 -1.226138
H  -2.086506 -1.551738 -0.605518
H  -2.620526 1.015364 1.033034
H  -2.708395 -0.64153 1.65771
H  3.92601 2.0290 0.995594
H  6.304664 2.344401 0.373104
H  6.247983 -1.60092 -1.45662
H  -5.403088 3.007307 0.021243
H  -3.671579 2.570047 -0.12467
H  -4.720258 2.6160 -1.573227
H  -7.478601 -1.320776 -0.736604
H  7.537232 0.506648 -0.893238
