program: Gaussian 09
title: 000211590
version: EM64L-G09RevD.01
frameworkgroup: C1[X(C18H32N4O2)]
method: RPBEPBE
basis: SDD
operation: Freq
keyword: #p
keyword: freq=noraman
keyword: PBEPBE/SDD
title: #p freq=noraman PBEPBE/SDD
converged: YES YES NO NO
title: Mulliken charges:
elementType: O O N N N N C C C C C C C C C C C C C C C C C C H H H H H H H H H H H H H H H H H H H H H H H H H H H H H H H H
charge: -0.284397 -0.284396 -0.103418 -0.103419 -0.336870 -0.336869 -0.360268 -0.360263 -0.441754 -0.441755 -0.324645 -0.326870 -0.324642 -0.326867 0.347384 0.347385 -0.670536 -0.670417 -0.670540 -0.670419 0.033230 0.033229 -0.467891 -0.467894 0.213239 0.234019 0.213238 0.234016 0.252129 0.224676 0.224675 0.252129 0.203299 0.196852 0.207204 0.193020 0.203298 0.196850 0.207203 0.193020 0.335636 0.335636 0.208167 0.226379 0.211916 0.207222 0.228149 0.210185 0.208167 0.226379 0.211917 0.207222 0.228149 0.210185 0.254362 0.254363
chargesum: 0.00000
title: Mulliken charges with hydrogens summed into heavy atoms:
elementType: O O N N N N C C C C C C C C C C C C C C C C C C
charge: -0.284397 -0.284396 -0.103418 -0.103419 -0.001234 -0.001233 0.086989 0.086991 0.035051 0.035049 0.075506 0.073355 0.075507 0.073357 0.347384 0.347385 -0.024074 -0.024862 -0.024076 -0.024863 0.033230 0.033229 -0.213529 -0.213531
polarizability: 3.89097815e+02 -3.64426820e+01 2.57312168e+02 1.42614503e-03 1.10228037e-02 1.66821284e+02
1716.lowfreq: -6.5875 -0.0009 -0.0001 0.0011 3.1196 5.8024 13.8800 17.5918 19.5523
frequency: 13.8077 17.5900 19.5501 25.0538 26.9433 47.7137 60.4371 69.3417 70.2896 75.8258 85.7732 89.1873 91.6645 146.1275 148.5959 160.3815 182.6801 191.2672 202.6068 212.1174 223.4082 237.5623 255.8367 268.7239 272.1165 291.8373 293.8173 299.7276 319.2846 381.8587 384.5509 400.3327 409.4748 434.9528 442.1471 447.5684 459.6464 474.5838 501.2952 508.5612 527.2248 556.4257 638.3240 684.2842 703.2462 728.8491 735.8426 748.6789 750.7158 767.8105 774.2270 779.5961 792.3540 795.0077 795.0748 799.3979 800.6433 821.8828 822.8111 848.6528 915.7210 916.2850 989.4556 989.6798 1011.8727 1017.9214 1039.1129 1053.6426 1069.9693 1070.6645 1071.1018 1073.2994 1075.8108 1075.8176 1084.8039 1084.8061 1123.5477 1125.2484 1168.2632 1177.7992 1207.4986 1208.8014 1215.7870 1217.7729 1250.1587 1250.8439 1255.2341 1280.6812 1282.6449 1288.4179 1288.9143 1294.0511 1296.2084 1302.6885 1319.8908 1320.6940 1329.5489 1347.7390 1359.9920 1360.0675 1364.4587 1364.4703 1375.3806 1375.5873 1388.2912 1388.3846 1389.3589 1389.3641 1460.3028 1460.3293 1463.8079 1463.8146 1468.9086 1469.1189 1470.7607 1470.9658 1479.3145 1479.3454 1485.8224 1485.8766 1487.1857 1487.3310 1489.9542 1491.4241 1491.4634 1498.9287 1545.1277 1576.6259 1621.0750 1635.4688 2861.4858 2861.4890 2868.8296 2869.0419 2904.6795 2904.8888 2982.5756 2982.5802 2984.5371 2984.5880 3005.7214 3005.9899 3017.2176 3017.2614 3039.4536 3039.4711 3044.4282 3044.4375 3074.9487 3075.0072 3077.4598 3077.4918 3083.7026 3083.7325 3091.5542 3091.5626 3091.9481 3091.9808 3155.1165 3157.4194 3378.7736 3383.3043
redmass: 4.8397 3.1815 3.7279 4.9411 4.1882 3.5949 2.4913 3.2835 3.1631 2.9618 3.6227 1.9802 2.2830 2.0248 4.5938 1.9431 3.0494 2.0164 1.4686 1.3487 1.8854 2.3058 1.8936 2.4306 2.0896 2.6322 2.2519 2.3798 3.3681 3.0017 3.0390 3.8409 4.7817 4.5689 3.1514 2.8262 3.1387 2.9243 4.3612 5.9589 4.2073 4.0259 5.3597 5.7567 2.9640 1.7064 6.2254 2.4311 2.6111 1.1509 1.3518 1.1986 1.2879 1.1633 1.1631 1.2139 1.2180 1.5745 2.3525 2.1820 1.9158 1.9150 2.3991 2.3503 3.6622 3.9384 2.9094 2.5966 2.2174 2.1327 2.7098 2.5310 1.8487 1.8363 2.1749 2.1857 1.7884 1.7681 1.7981 1.7002 2.3562 2.2640 2.6883 1.4794 1.7154 1.5239 1.8718 1.1643 1.1518 1.2259 1.2223 1.3126 1.1724 1.3413 1.4174 1.3017 3.1104 4.6422 1.3148 1.3053 1.3312 1.3321 1.3450 1.3446 1.2361 1.2372 1.2331 1.2332 1.0619 1.0660 1.0529 1.0522 1.0784 1.0660 1.0770 1.0685 1.0565 1.0557 1.0798 1.0707 1.1826 1.1022 1.7261 1.0780 1.0894 2.4249 4.1745 5.6595 8.4797 7.1864 1.0719 1.0719 1.0714 1.0714 1.0700 1.0700 1.0357 1.0357 1.0357 1.0357 1.0629 1.0629 1.0877 1.0877 1.0874 1.0874 1.0893 1.0893 1.0984 1.0984 1.0982 1.0982 1.1026 1.1026 1.1004 1.1004 1.1003 1.1003 1.0912 1.0913 1.0753 1.0761
irintensity: 0.6830 0.0058 0.0031 0.3275 0.0001 0.1120 1.3015 0.7156 0.0394 0.8180 2.0983 0.2340 2.0205 0.8703 0.6928 0.3340 3.8739 3.7094 0.4508 0.2615 0.1548 0.0493 0.0703 7.6388 0.0930 2.9545 2.4407 0.0413 11.1880 3.1897 19.2552 4.5031 19.1888 0.2808 38.2644 0.0761 2.8205 3.5639 1.2510 5.7050 2.7874 6.9584 0.3657 4.0341 3.4084 1.4280 0.0315 4.0381 6.2023 195.6052 10.2523 13.2156 2.4498 6.9211 1.7890 14.3671 0.3933 68.1653 1.8185 30.5611 0.1906 3.2974 2.9113 5.5976 1.2933 24.0383 6.7646 10.6250 72.0582 1.9043 122.9074 3.2547 23.2217 17.9992 1.3119 3.7625 21.4083 2.1348 31.9403 10.2853 69.8159 10.7010 48.9498 3.2767 2.6570 27.8952 0.0029 36.4172 0.0682 40.5525 17.7056 38.7566 5.2302 33.7947 40.3189 0.0067 110.8829 1.5454 5.6278 13.2785 9.1709 0.5944 12.6432 0.2782 60.8207 3.1403 35.2229 10.0512 7.7144 5.5175 11.1953 7.1231 1.0668 1.1726 0.4184 40.2662 8.7205 1.5294 70.1437 1.3202 96.5518 21.0961 482.2800 10.9748 9.5906 5.1988 0.5431 321.7616 557.6812 2.4919 23.5502 37.4853 65.1845 218.1812 56.3457 62.3952 58.1102 6.0586 67.9811 3.5621 69.0244 20.9173 34.8414 15.8295 22.9787 0.2661 16.0343 21.6506 88.5607 2.9287 111.9589 42.0843 55.6912 0.5215 44.3516 5.3391 5.2991 102.9362 24.1510 0.0131 0.1066 180.8296
temp: 298.150 k
press: 1.00000 atm
elementType: 8 8 7 7 7 7 6 6 6 6 6 6 6 6 6 6 6 6 6 6 6 6 6 6 1 1 1 1 1 1 1 1 1 1 1 1 1 1 1 1 1 1 1 1 1 1 1 1 1 1 1 1 1 1 1 1
symmnumber: 1
zpe: 1269708.4 jmol-1
zpe.correction: 0.483606 hartree
zpe.thermalcorrener: 0.511565 hartree
zpe.thermalcorrenthalpy: 0.512509 hartree
zpe.thermalcorrgfe: 0.420514 hartree
zpe.sumelectzpe: -1072.639266 hartree
zpe.sumelectthermal: -1072.611308 hartree
zpe.sumelectthermalent: -1072.610364 hartree
zpe.sumelectthermalfe: -1072.702358 hartree
dipole: -0.0001 -0.0003 2.1231
dipole: 2.1231
quadrupole: -112.5739 -161.7159 -147.8061
quadrupole: -2.3312 0.0006 -0.0019
quadrupole: 28.1247 -21.0173 -7.1075 -2.3312 0.0006 -0.0019
hfenergy: -1073.1228727 hartree
pointgroup: C01 [X(C18H32N4O2)]
dipole: -0.0000249 0.0001032 -0.8353075 debye
polarizability: 390.0304305|34.7029381|256.3795519|-0.0012815|0.0110405|166.8212841 unknown
InChI: InChI=1S/C18H32N4O2/c1-5-21(6-2)11-9-19-15-13-18(24)16(14-17(15)23)20-10-12-22(7-3)8-4/h13-14,19-20H,5-12H2,1-4H3
charge 0 multiplicity 1
56 atoms
O  0.220291 2.741489 0.940334
O  -0.220179 -2.741674 0.939612
N  5.66295 -0.150197 -0.418638
N  -5.662928 0.150342 -0.418312
N  2.446433 1.32704 0.977088
N  -2.44632 -1.327233 0.976852
C  4.310858 0.446762 -0.469295
C  -4.310838 -0.446605 -0.4692
C  3.814641 0.805267 0.961929
C  -3.814527 -0.805451 0.961906
C  5.636009 -1.622948 -0.199586
C  6.548192 0.269335 -1.537951
C  -5.635963 1.623038 -0.198894
C  -6.548228 -0.268899 -1.53769
C  1.306939 0.584487 0.950037
C  -1.306828 -0.584675 0.949942
C  6.908634 -2.157994 0.483603
C  7.052277 1.717577 -1.391005
C  -6.908566 2.157936 0.484452
C  -7.052318 -1.717173 -1.391089
C  0.049111 1.464881 0.945032
C  -0.0490 -1.465068 0.944642
C  1.226418 -0.81009 0.941716
C  -1.226307 0.809905 0.94199
H  4.339896 1.374022 -1.068871
H  3.566838 -0.225927 -0.957314
H  -4.339917 -1.373722 -1.068993
H  -3.566852 0.2262 -0.957109
H  4.493357 1.562603 1.389097
H  3.873535 -0.088527 1.611181
H  -3.873371 0.088189 1.611377
H  -4.493221 -1.562884 1.388938
H  4.768757 -1.851505 0.448903
H  5.459941 -2.171663 -1.158953
H  7.421847 -0.406927 -1.544177
H  6.043017 0.141809 -2.528428
H  -4.768694 1.851422 0.449633
H  -5.459908 2.17199 -1.158128
H  -7.421878 0.40737 -1.543698
H  -6.0431 -0.141122 -2.528158
H  2.262231 2.343592 0.970308
H  -2.262122 -2.343784 0.969797
H  7.81053 -1.993956 -0.133438
H  7.06262 -1.650669 1.451901
H  6.820574 -3.245815 0.66195
H  6.221419 2.446935 -1.394567
H  7.603147 1.832946 -0.441417
H  7.726905 1.978716 -2.227614
H  -7.810477 1.994068 -0.132613
H  -7.062544 1.650375 1.452628
H  -6.820483 3.24571 0.663067
H  -6.221471 -2.446542 -1.394887
H  -7.603137 -1.832782 -0.4415
H  -7.726996 -1.978088 -2.227727
H  2.113988 -1.449286 0.933023
H  -2.113876 1.449103 0.933513
