program: Gaussian 09
title: 000216825
version: EM64L-G09RevD.01
frameworkgroup: C1[X(C9H20NO3PS2)]
method: RPBEPBE
basis: SDD
operation: Freq
keyword: #p
keyword: freq=noraman
keyword: PBEPBE/SDD
title: #p freq=noraman PBEPBE/SDD
converged: NO YES NO NO
title: Mulliken charges:
elementType: S S P O O O N C C C C C C C C C H H H H H H H H H H H H H H H H H H H H
charge: 0.072546 -0.222050 0.586834 -0.524337 -0.460941 -0.271569 -0.354399 -0.361872 -0.339515 -0.804039 0.295287 -0.714897 -0.200610 -0.258410 -0.653493 -0.639921 0.251510 0.196619 0.229836 0.197150 0.365833 0.311140 0.302726 0.269431 0.196583 0.213015 0.230274 0.239312 0.239633 0.232432 0.222193 0.226793 0.234571 0.218730 0.232102 0.241499
chargesum: 0.00000
title: Mulliken charges with hydrogens summed into heavy atoms:
elementType: S S P O O O N C C C C C C C C C
charge: 0.072546 -0.222050 0.586834 -0.524337 -0.460941 -0.271569 0.011434 0.086257 0.087471 -0.190172 0.295287 -0.035868 0.268976 0.213655 0.030065 0.052411
polarizability: 2.16292968e+02 4.78294633e+00 1.61516580e+02 -1.15609165e+01 -1.71417867e+00 1.69365158e+02
1716.lowfreq: -0.0014 0.0005 0.0020 2.5448 8.9320 11.1382 18.2046 26.0637 32.5169
frequency: 18.0607 25.7845 32.2921 42.2904 48.1555 55.5486 64.5291 69.1772 84.6151 101.2782 116.9708 132.1195 144.4023 168.0349 174.2436 203.0270 228.2343 239.1981 243.2540 262.2011 274.3083 286.8401 297.2523 321.5011 363.0982 396.9383 417.7383 454.2833 460.4708 536.9241 550.6698 629.1436 642.1469 677.3896 716.4298 737.5167 757.4331 794.1437 810.5077 834.0448 850.0097 861.1770 864.2275 877.6514 938.4881 1007.2645 1011.3086 1018.1827 1090.4938 1092.3155 1101.7447 1108.9989 1131.4492 1137.5990 1139.0804 1152.7002 1238.9363 1250.9357 1251.3367 1267.0747 1267.8739 1290.0862 1342.0349 1347.5791 1349.5549 1360.4404 1393.2058 1396.3663 1397.2458 1408.2326 1450.9632 1458.7021 1461.3362 1461.8695 1464.3244 1475.9237 1476.3929 1482.6667 1486.6728 1501.7127 1521.2530 1618.3767 2967.6277 2984.3636 2989.1079 2993.5576 2993.8318 2998.0697 2999.5076 3040.4839 3047.5741 3061.9987 3062.4409 3071.8476 3074.0503 3077.3907 3088.1216 3090.2688 3107.1617 3108.1067 3132.1412 3439.0517
redmass: 3.5313 4.6900 3.4565 3.9630 3.1586 2.4467 4.1497 3.2618 4.5349 4.7063 2.6639 6.4385 3.1438 2.6460 6.3937 4.2984 1.5348 1.4572 1.4181 2.8745 3.3658 3.8615 4.3232 1.9377 4.4664 2.2699 4.5776 2.9807 5.2603 11.6712 4.3552 7.0651 4.8529 8.1666 1.4542 2.5455 1.5084 1.1201 1.0948 1.7909 3.8285 2.6872 3.2312 1.8962 1.9554 1.9195 2.5433 2.8691 2.1727 2.6188 2.2369 1.7683 1.4178 1.5531 1.8532 1.3864 1.1814 1.1569 1.2068 1.1132 2.1681 1.2467 1.3951 1.2217 1.2503 1.2598 1.2255 1.2333 1.2182 1.1124 1.1073 1.0604 1.0411 1.0551 1.0760 1.0557 1.0550 1.0480 1.0830 1.0761 1.6250 6.1104 1.0362 1.0623 1.0363 1.0583 1.0419 1.0560 1.0622 1.0978 1.0570 1.0988 1.1078 1.1012 1.1013 1.1009 1.0987 1.0983 1.1026 1.1025 1.1076 1.0808
irintensity: 0.3245 1.5365 1.8002 2.5641 0.8430 0.5840 0.7191 2.3078 2.1563 2.8886 0.7753 1.1113 2.9344 2.1734 5.0842 2.0511 1.7656 1.5908 2.6073 6.6936 0.7888 3.1278 5.3380 5.4491 11.8974 6.5259 6.7624 4.1389 22.4278 81.7407 7.9574 82.7104 1.8928 144.3953 70.8137 13.7790 21.0720 2.5210 2.6736 0.7630 178.0239 15.0034 69.4686 2.8201 2.6581 4.1690 160.0690 65.1216 8.7020 4.3723 10.1244 2.4074 4.5093 4.6107 0.0057 24.4146 5.0741 1.9235 4.6017 0.3015 28.4329 29.7193 1.9397 13.0968 3.3939 1.0087 31.9618 24.2112 14.2326 28.0491 17.5510 9.8971 18.8557 10.5215 10.5616 12.1866 5.5078 11.7520 6.8833 7.1030 136.0299 209.3791 29.6410 35.8056 11.4507 54.3213 3.8992 18.3557 38.3874 15.6579 4.0592 44.4695 7.5702 23.0624 8.8396 33.3922 29.5463 25.0265 22.8432 33.4242 3.6391 151.8588
temp: 298.150 k
press: 1.00000 atm
elementType: 16 16 15 8 8 8 7 6 6 6 6 6 6 6 6 6 1 1 1 1 1 1 1 1 1 1 1 1 1 1 1 1 1 1 1 1
symmnumber: 1
zpe: 762874.7 jmol-1
zpe.correction: 0.290564 hartree
zpe.thermalcorrener: 0.312738 hartree
zpe.thermalcorrenthalpy: 0.313682 hartree
zpe.thermalcorrgfe: 0.235574 hartree
zpe.sumelectzpe: -1771.433256 hartree
zpe.sumelectthermal: -1771.411082 hartree
zpe.sumelectthermalent: -1771.410137 hartree
zpe.sumelectthermalfe: -1771.488245 hartree
dipole: 1.4771 -0.4120 -4.9468
dipole: 5.1790
quadrupole: -139.7107 -106.3116 -122.1973
quadrupole: 3.1186 5.9631 2.3431
quadrupole: -16.9708 16.4282 0.5426 3.1186 5.9631 2.3431
hfenergy: -1771.7238193 hartree
pointgroup: C01 [X(C9H20N1O3P1S2)]
dipole: -1.0186778 -1.0082612 1.4482465 debye
polarizability: 199.0370172|-20.0358302|174.1194865|-19.3302307|7.3450916|174.0182013 unknown
InChI: InChI=1S/C5H10NOS.C4H10O2PS/c1-2-3-6-5(7)4-8;1-3-5-7(8)6-4-2/h6H,2-4H2,1H3;3-4H2,1-2H3
charge 0 multiplicity 1
36 atoms
S  0.0841 1.691786 -1.722006
S  -3.147491 2.038914 0.102071
P  -1.381441 0.988153 -0.107808
O  -1.462336 -0.707373 -0.526509
O  -0.473034 0.774884 1.366996
O  2.873768 -0.63235 -2.580901
N  1.418493 -1.462361 -0.950714
C  2.452044 -2.272693 -0.281093
C  3.163738 -1.543968 0.885269
C  0.537918 0.081584 -2.648828
C  1.719272 -0.689681 -2.051181
C  2.253032 -1.289993 2.105247
C  -2.597678 -1.514398 0.026532
C  -0.483835 1.856383 2.395618
C  -2.567691 -2.855974 -0.698645
C  0.445539 3.013626 2.023275
H  3.19555 -2.541886 -1.051804
H  1.979292 -3.202945 0.089843
H  3.571302 -0.589605 0.502046
H  4.032909 -2.161903 1.188102
H  0.465357 -1.414768 -0.568719
H  0.826955 0.449529 -3.646236
H  -0.37828 -0.525127 -2.712219
H  1.387313 -0.657755 1.836752
H  1.86953 -2.243865 2.517707
H  2.810142 -0.779227 2.912683
H  -2.445229 -1.6235 1.116224
H  -3.53889 -0.963357 -0.157566
H  -1.527559 2.196036 2.542301
H  -0.138793 1.329552 3.30091
H  -3.388302 -3.494721 -0.32303
H  -1.614346 -3.384636 -0.525936
H  -2.703747 -2.719009 -1.784728
H  0.503147 3.727047 2.866396
H  0.075219 3.563306 1.13964
H  1.462929 2.646694 1.806414
