program: Gaussian 09
title: 000216844
version: EM64L-G09RevD.01
frameworkgroup: C1[X(C11H23Cl2N2O5PS)]
method: RPBEPBE
basis: SDD
operation: Freq
keyword: #p
keyword: freq=noraman
keyword: PBEPBE/SDD
title: #p freq=noraman PBEPBE/SDD
converged: YES YES NO NO
title: Mulliken charges:
elementType: Cl Cl S P O O O O O N N C C C C C C C C C C C H H H H H H H H H H H H H H H H H H H H H H H
charge: -0.063108 -0.058606 1.054465 1.310035 -0.479207 -0.591086 -0.416665 -0.520115 -0.506171 -0.481725 -0.529004 -0.339686 -0.378321 -0.311406 -0.311396 -0.378060 -0.314549 -0.271533 -0.261075 -0.557786 -0.573732 -0.728996 0.223287 0.233617 0.232996 0.208526 0.228107 0.224400 0.241692 0.220212 0.224818 0.227627 0.279873 0.232985 0.265067 0.238392 0.233292 0.221486 0.259610 0.301776 0.267464 0.277856 0.284238 0.289614 0.290789
chargesum: 0.00000
title: Mulliken charges with hydrogens summed into heavy atoms:
elementType: Cl Cl S P O O O O O N N C C C C C C C C C C C
charge: -0.063108 -0.058606 1.054465 1.310035 -0.479207 -0.591086 -0.416665 -0.520115 -0.506171 -0.481725 -0.529004 0.117218 0.063201 0.141101 0.150509 0.074385 0.198309 0.231926 0.193703 0.003601 -0.028411 0.135645
polarizability: 2.62221055e+02 3.42129504e+00 2.18944250e+02 -1.25374116e+01 3.64057540e+00 1.99686073e+02
1716.lowfreq: -9.9823 -6.3009 -3.9773 -0.0022 0.0008 0.0017 3.5336 8.7896 14.3669
frequency: 2.1237 8.6254 14.2363 28.9103 32.7158 34.8784 43.3992 56.0660 65.6039 72.8577 83.3154 90.9112 100.9427 120.2322 124.9194 144.5961 150.8755 153.8695 182.9542 193.5685 207.9230 215.3482 216.1276 222.1685 265.5526 276.9623 282.7973 299.5440 308.1922 321.8608 345.8494 361.6689 376.6132 384.5312 415.0408 427.7110 453.5657 491.9561 539.7532 561.0334 590.2370 601.9278 663.9981 671.7312 691.8246 729.7950 764.1284 770.8627 776.6207 822.5464 836.9378 860.4186 886.4921 908.9149 912.7468 925.0056 934.7234 959.5675 996.4364 1001.3636 1018.5945 1028.6967 1038.8930 1039.1870 1044.8428 1051.8392 1061.7703 1066.6238 1066.8057 1106.4632 1116.2569 1127.1899 1140.4391 1187.5868 1198.0615 1205.0402 1231.2755 1235.8451 1254.6348 1260.0296 1263.3249 1267.9985 1283.9853 1289.8258 1298.9947 1316.5252 1330.7038 1348.2000 1353.2454 1356.8155 1362.5296 1364.2821 1373.1379 1374.7698 1415.6705 1417.5506 1440.3654 1447.1103 1452.1139 1461.1088 1464.0324 1466.3730 1472.3976 1474.2679 1479.7412 1491.0846 2919.0965 2939.3879 2976.1689 2991.3455 3000.3540 3005.3712 3013.4621 3023.8594 3024.5548 3037.8936 3041.4619 3048.7376 3060.7621 3064.8969 3067.8094 3082.1544 3085.9120 3091.1796 3094.4273 3150.8359 3155.0426 3190.0882 3198.6251
redmass: 9.7343 10.0917 5.6204 9.6960 7.5280 7.8464 5.6442 4.1471 2.7559 3.0247 2.5305 2.3370 5.2449 3.2558 4.3001 2.8569 1.1794 2.6561 4.8981 3.7483 5.8000 6.3103 4.9297 5.6270 4.0931 4.0968 5.1042 2.9367 4.6313 2.7178 4.3828 7.1292 6.1030 6.0795 6.0995 5.3144 4.7488 5.2913 2.1921 7.0942 6.3659 8.2954 7.5980 7.0615 5.4122 3.9979 1.1335 1.1845 1.2005 2.3848 11.1766 1.7666 1.3677 2.5192 2.7860 2.6067 5.2018 2.6590 1.4315 1.4525 5.3579 3.7594 2.0434 2.3635 3.3474 3.2568 3.3619 2.4158 2.5760 2.0844 1.6370 2.4369 2.0190 1.2163 1.2200 2.2247 1.5654 1.3311 1.1835 1.1725 1.1463 1.1966 1.1806 1.1584 1.1872 1.1334 1.2286 1.2623 1.2686 1.3450 1.2642 1.2862 1.3208 1.3287 1.0518 1.0505 1.0905 1.0844 1.0942 1.0838 1.0795 1.0776 1.0749 1.0845 1.0817 1.0862 1.0701 1.0656 1.0548 1.0656 1.0618 1.0647 1.0626 1.0615 1.0908 1.1075 1.0248 1.0909 1.0567 1.0582 1.1004 1.1054 1.0981 1.1043 1.1017 1.1123 1.1109 1.1078 1.1078
irintensity: 0.8500 0.7541 2.5232 0.6839 0.8961 0.9120 0.5766 1.4695 2.6024 3.6924 5.0977 2.4128 8.6287 0.5455 2.1799 8.0410 1.8693 0.8164 3.8500 2.2274 2.5900 0.3057 1.0538 2.5352 19.5352 24.2444 10.3961 1.6184 6.9447 11.9413 4.2895 16.7113 16.0492 3.2773 42.0077 11.3702 28.2366 11.7553 20.3991 67.5640 19.5634 75.3911 102.7203 17.9327 101.0359 130.0390 12.4939 2.9307 24.2338 64.6456 68.7862 26.9043 26.2855 73.3493 28.3088 58.6838 73.4067 94.9770 45.3024 2.7354 84.9929 50.8070 71.9979 14.9396 38.0072 24.2533 50.4254 22.4784 13.5401 13.9000 46.7376 36.6360 34.4303 3.8260 6.1935 62.4052 8.5322 16.0432 10.1596 11.3463 4.3701 7.3888 6.0308 6.2590 8.8893 3.7385 12.6290 4.1028 3.4377 1.4481 0.5539 5.4628 23.0792 3.4990 13.5135 12.0684 14.6759 13.8437 1.6459 29.6618 4.7790 5.0813 13.8544 6.0458 6.1502 19.2415 57.5624 36.1453 32.6814 41.7326 29.4689 18.6119 16.1356 13.2409 8.7477 6.0755 0.1302 24.3332 11.1930 17.8147 34.8587 50.0652 2.9511 1.6373 22.6497 6.8971 13.6811 0.0739 0.0027
temp: 298.150 k
press: 1.00000 atm
elementType: 17 17 16 15 8 8 8 8 8 7 7 6 6 6 6 6 6 6 6 6 6 6 1 1 1 1 1 1 1 1 1 1 1 1 1 1 1 1 1 1 1 1 1 1 1
symmnumber: 1
zpe: 919902.8 jmol-1
zpe.correction: 0.350372 hartree
zpe.thermalcorrener: 0.378459 hartree
zpe.thermalcorrenthalpy: 0.379403 hartree
zpe.thermalcorrgfe: 0.282755 hartree
zpe.sumelectzpe: -2576.009819 hartree
zpe.sumelectthermal: -2575.981732 hartree
zpe.sumelectthermalent: -2575.980788 hartree
zpe.sumelectthermalfe: -2576.077436 hartree
dipole: -2.6258 4.3934 5.3810
dipole: 7.4264
quadrupole: -176.5142 -156.4197 -181.5590
quadrupole: 8.5856 -10.0175 4.3804
quadrupole: -5.0165 15.0779 -10.0614 8.5856 -10.0175 4.3804
hfenergy: -2576.3601912 hartree
pointgroup: C01 [X(C11H23Cl2N2O5P1S1)]
dipole: -0.9253383 -1.364397 -2.4122395 debye
polarizability: 261.2020855|-5.428614|217.1859469|14.2567891|6.4094636|202.4633454 unknown
InChI: InChI=1S/C11H23Cl2N2O5PS/c1-22(17,18)20-11-3-7-14-6-2-10-19-21(14,16)15(8-4-12)9-5-13/h2-11H2,1H3
charge 0 multiplicity 1
45 atoms
Cl 5.189331 2.729043 2.488689
Cl 0.729507 3.018573 -2.898167
S  -5.560341 0.729583 0.534712
P  2.220128 -0.937156 0.430579
O  3.276423 -1.527092 -0.83196
O  2.595594 -1.365039 1.923804
O  -4.083899 -0.122208 -0.256629
O  -5.042324 2.084543 1.258167
O  -6.451657 -0.33668 1.361831
N  0.641992 -1.438759 -0.208507
N  2.319402 0.77712 0.206622
C  0.575187 -2.84279 -0.730419
C  1.649449 -3.127938 -1.799526
C  -0.519929 -1.044989 0.639933
C  3.07113 -2.942909 -1.250029
C  -1.785168 -0.783151 -0.211197
C  2.932629 1.586796 1.288764
C  2.164315 1.385372 -1.13311
C  -2.944595 -0.297555 0.672541
C  4.468328 1.504877 1.241499
C  0.857085 2.188351 -1.203453
C  -6.379918 1.117796 -1.130304
H  0.664638 -3.577135 0.103504
H  -0.424625 -2.976356 -1.178808
H  1.501146 -2.455212 -2.663707
H  1.529309 -4.170307 -2.153714
H  -0.730462 -1.820507 1.409152
H  -0.247228 -0.12032 1.183831
H  3.842157 -3.113567 -2.017964
H  3.265111 -3.61018 -0.386428
H  -2.104771 -1.702429 -0.734125
H  -1.564908 -0.025818 -0.984104
H  2.578381 1.223806 2.268193
H  2.603674 2.634517 1.169905
H  2.161538 0.594792 -1.901615
H  3.023768 2.047943 -1.349743
H  -2.70355 0.668941 1.158007
H  -3.199223 -1.047765 1.446352
H  4.880307 1.796417 0.263811
H  4.830935 0.51232 1.544888
H  0.816667 3.006912 -0.469496
H  -0.024695 1.53917 -1.116883
H  -7.333964 1.606984 -0.890916
H  -5.683966 1.776272 -1.664788
H  -6.514109 0.150334 -1.631094
