program: Gaussian 09
title: 000216816
version: EM64L-G09RevD.01
frameworkgroup: C1[X(C14H11FN2O4)]
method: RPBEPBE
basis: SDD
operation: Freq
keyword: #p
keyword: freq=noraman
keyword: PBEPBE/SDD
title: #p freq=noraman PBEPBE/SDD
converged: YES YES NO NO
title: Mulliken charges:
elementType: F O O O O N N C C C C C C C C C C C C C C H H H H H H H H H H H
charge: -0.186861 -0.280573 -0.279609 -0.236253 -0.259517 0.002544 0.000695 -0.233721 -0.314887 0.226002 0.224776 0.226386 0.229885 -0.380587 -0.258278 -0.407582 -0.418589 0.330622 -0.177147 -0.407173 -0.313609 0.236496 0.250445 0.231868 0.252492 0.335885 0.279982 0.286014 0.280043 0.241134 0.269073 0.250044
chargesum: 0.00000
title: Mulliken charges with hydrogens summed into heavy atoms:
elementType: F O O O O N N C C C C C C C C C C C C C C
charge: -0.186861 -0.280573 -0.279609 -0.236253 -0.259517 0.002544 0.000695 0.253220 0.169473 0.226002 0.224776 0.226386 0.229885 -0.044702 0.021704 -0.121568 -0.138546 0.330622 0.063988 -0.138100 -0.063565
polarizability: 1.84860222e+02 4.67076815e+00 2.09516139e+02 6.75231878e+00 -1.18218839e+01 1.23393332e+02
1716.lowfreq: -7.9882 -4.7989 -3.0903 0.0005 0.0006 0.0009 10.2112 16.0715 24.4681
frequency: 10.0717 15.9838 24.4387 50.0140 54.9701 61.3162 90.5025 125.9646 137.5144 176.3279 201.8867 214.0727 220.5486 262.6421 322.9036 334.5585 342.3231 359.0025 374.2597 421.5771 440.3170 445.1162 462.9736 499.0345 503.9275 534.9140 608.2839 642.0490 674.9610 693.6260 694.9110 717.9375 735.1468 754.0921 766.2884 830.9463 833.6096 846.0979 898.7167 929.1637 939.8508 948.5276 949.8013 967.5135 983.3405 1000.2912 1002.6624 1006.9925 1019.2330 1027.3548 1059.7793 1073.0176 1106.5269 1112.0152 1132.9760 1171.8879 1196.6087 1209.2829 1241.9010 1255.6254 1266.4278 1297.2936 1311.8178 1318.9170 1327.5270 1355.2410 1373.7593 1408.4639 1416.5416 1431.3028 1442.4249 1454.7644 1455.9858 1547.1163 1550.8607 1584.8385 1585.3610 1624.2797 1631.3717 3010.8062 3038.0279 3081.9713 3113.9184 3137.7401 3155.6478 3156.0124 3162.5826 3165.8723 3167.5524 3176.3002
redmass: 8.1989 8.8137 5.3832 8.0687 8.3274 8.1715 9.3658 4.3486 5.4312 4.8111 4.9530 6.2437 4.3329 4.6506 3.3298 5.6982 7.0842 5.2322 3.0464 4.5054 5.5929 5.1057 7.0054 5.1139 3.5356 6.0838 7.7530 9.4346 6.3794 3.5294 7.3432 1.8235 3.9073 5.6959 7.0009 3.9938 1.7675 3.9039 1.5939 5.8849 1.3790 1.3604 1.4945 1.5009 3.1684 5.1331 3.2945 1.3827 3.4560 2.8947 3.6029 3.2443 1.8873 2.1311 2.3554 2.1703 1.3182 1.1189 2.9314 2.7914 1.2093 1.4072 11.1070 6.2255 1.2558 1.3626 1.4048 2.1380 2.9987 2.6355 1.1119 1.8438 1.1719 6.6273 5.8817 5.8878 6.5781 10.8149 11.6497 1.0579 1.0594 1.1053 1.1077 1.0889 1.0915 1.0913 1.0941 1.0927 1.0958 1.1004
irintensity: 0.5853 0.1371 0.5351 0.7227 4.0266 0.7796 0.9473 0.4512 1.4969 4.0188 8.1677 5.4357 1.1696 6.0790 21.1591 0.4161 4.7813 0.9687 1.6564 2.3916 13.5806 2.5956 2.9430 1.0080 6.1618 10.0760 1.6099 1.2964 3.5236 4.6718 10.7369 61.9671 36.4604 0.9308 18.7522 1.1061 20.3748 9.2348 24.7853 33.6912 1.4351 13.0068 4.9950 2.0638 11.9716 34.5042 38.4718 0.8836 0.3479 23.2523 248.3480 168.6006 44.9275 17.0495 25.9164 188.9706 5.9985 3.9511 165.8313 275.7353 74.5103 10.9527 1.9364 10.5601 3.3242 5.8473 7.0780 28.3918 68.7894 2.2264 27.4142 12.4991 10.9725 49.7260 2.1610 36.4264 29.1716 187.2582 216.6775 14.9946 32.0510 18.1240 7.7085 10.1188 5.7350 8.2671 2.1372 6.0737 24.1398 13.5518
temp: 298.150 k
press: 1.00000 atm
elementType: 9 8 8 8 8 7 7 6 6 6 6 6 6 6 6 6 6 6 6 6 6 1 1 1 1 1 1 1 1 1 1 1
symmnumber: 1
zpe: 600937.5 jmol-1
zpe.correction: 0.228885 hartree
zpe.thermalcorrener: 0.247334 hartree
zpe.thermalcorrenthalpy: 0.248278 hartree
zpe.thermalcorrgfe: 0.177525 hartree
zpe.sumelectzpe: -1048.822206 hartree
zpe.sumelectthermal: -1048.803757 hartree
zpe.sumelectthermalent: -1048.802813 hartree
zpe.sumelectthermalfe: -1048.873566 hartree
dipole: -2.2863 0.5590 1.8407
dipole: 2.9879
quadrupole: -135.2527 -103.9002 -127.7544
quadrupole: 4.8011 0.8886 7.9593
quadrupole: -12.9503 18.4023 -5.4520 4.8011 0.8886 7.9593
hfenergy: -1049.0510905 hartree
pointgroup: C01 [X(C14H11F1N2O4)]
dipole: 0.9175439 -0.4479871 0.5825039 debye
polarizability: 184.734713|8.5677236|195.5435452|-6.5776587|33.2350151|137.4914351 unknown
InChI: InChI=1S/C14H11FN2O4/c15-12-6-11(8-17-9-12)14(19)21-5-4-20-13(18)10-2-1-3-16-7-10/h1-3,6-9H,4-5H2
charge 0 multiplicity 1
32 atoms
F  -2.038716 2.604522 2.219037
O  -1.05179 -1.684714 -0.178803
O  1.862189 -2.072478 -0.147184
O  -2.820832 -2.048937 -1.65655
O  1.243349 -0.708103 1.6557
N  -4.551881 1.63329 -0.297493
N  4.657241 0.634568 -1.564939
C  -0.3997 -2.940272 -0.617281
C  0.849483 -3.087011 0.2409
C  -2.782476 -0.059271 -0.229577
C  2.960757 0.037804 0.098325
C  -2.265673 -1.346352 -0.77985
C  1.940855 -0.908813 0.632867
C  -2.091431 0.653185 0.78503
C  3.178015 1.259348 0.786201
C  -4.000675 0.465355 -0.736498
C  3.72354 -0.228158 -1.070272
C  -2.674517 1.851314 1.219801
C  4.138918 2.159251 0.284551
C  -3.88835 2.321909 0.677156
C  4.851107 1.806992 -0.88705
H  -1.089112 -3.791199 -0.460592
H  -0.158779 -2.871196 -1.692757
H  1.331596 -4.059544 0.049212
H  0.607186 -2.973293 1.311599
H  -1.152595 0.280958 1.206837
H  2.596472 1.475376 1.688263
H  -4.544208 -0.074403 -1.518047
H  3.579952 -1.160289 -1.624025
H  4.33656 3.112288 0.783939
H  -4.333272 3.259263 1.027405
H  5.607082 2.479109 -1.308704
