program: Gaussian 09
title: 000216828
version: EM64L-G09RevD.01
frameworkgroup: C1[X(C12H26NO3PS2)]
method: RPBEPBE
basis: SDD
operation: Freq
keyword: #p
keyword: freq=noraman
keyword: PBEPBE/SDD
title: #p freq=noraman PBEPBE/SDD
converged: YES YES NO NO
title: Mulliken charges:
elementType: S S P O O O N C C C C C C C C C C C C H H H H H H H H H H H H H H H H H H H H H H H H H H
charge: 0.116977 -0.244744 0.560696 -0.272087 -0.490075 -0.474891 -0.117705 -0.350148 -0.377436 -0.346744 -0.339304 0.279338 -0.769491 -0.680229 -0.674967 -0.201175 -0.219448 -0.657694 -0.652566 0.254138 0.198637 0.228536 0.217454 0.188663 0.239164 0.206955 0.215244 0.295419 0.318028 0.221540 0.222727 0.204342 0.211787 0.227672 0.210648 0.229900 0.226134 0.235654 0.220250 0.212574 0.221985 0.236434 0.212649 0.225462 0.229694
chargesum: 0.00000
title: Mulliken charges with hydrogens summed into heavy atoms:
elementType: S S P O O O N C C C C C C C C C C C C
charge: 0.116977 -0.244744 0.560696 -0.272087 -0.490075 -0.474891 -0.117705 0.102627 0.068553 0.081083 0.082895 0.279338 -0.156043 -0.031620 -0.024859 0.254859 0.236457 0.013299 0.015239
polarizability: 2.88700326e+02 3.64731133e+00 2.04550928e+02 1.14062016e+01 1.06492637e+01 1.77004907e+02
1716.lowfreq: -5.6956 -2.6831 0.0010 0.0024 0.0028 7.1451 9.5781 16.4825 24.3956
frequency: 7.0167 16.2952 24.3591 30.4162 38.6947 39.9999 48.4920 53.7857 63.5414 70.3692 81.3346 82.9013 93.8027 101.7619 120.6676 125.9071 138.6993 147.8156 206.4152 216.7387 219.4351 220.1035 244.8919 246.4459 259.3105 261.1433 281.9320 287.0916 290.2560 313.7154 322.0486 358.5468 407.1038 418.7645 455.6237 522.6739 553.8119 559.9517 635.6750 655.2746 685.3598 725.7376 745.6886 747.2763 789.8664 809.2611 812.3685 863.4856 865.2364 867.6651 874.1318 887.5744 892.1854 909.5234 990.8510 1018.9829 1027.8335 1046.7686 1051.4422 1091.8321 1102.7012 1103.8062 1104.1755 1111.6785 1129.9555 1135.9783 1136.4456 1147.8083 1205.4038 1214.8265 1251.5932 1255.0135 1260.8009 1265.7873 1289.3084 1296.1503 1299.6297 1311.0650 1353.1430 1354.4065 1358.3227 1364.4177 1392.0109 1392.5944 1392.8920 1394.4029 1419.4573 1432.5998 1449.6438 1458.1125 1458.5704 1472.6616 1473.3548 1476.2816 1477.2792 1478.0610 1479.0767 1479.7102 1485.9712 1486.9344 1489.7747 1491.1333 1566.5141 2975.8448 2976.5526 2981.1354 2981.7120 2985.0958 2989.7117 2992.8633 2993.9628 2994.2566 2996.9611 3028.5645 3031.9909 3040.8828 3044.6624 3054.2990 3054.4931 3067.4458 3073.6591 3080.4338 3081.9650 3082.4904 3088.0895 3090.1149 3105.7773 3105.9021 3113.7243
redmass: 4.3931 3.9057 4.0186 3.5649 2.1820 2.8181 3.7183 3.2674 2.0949 4.1321 1.9724 1.7479 4.8465 4.9081 6.0555 2.9531 4.3587 5.4711 3.9007 1.2117 1.8749 1.2985 2.5222 1.3716 1.9200 2.5315 3.7141 6.3289 3.4981 3.7678 4.6193 2.9537 5.6814 3.8362 8.3010 3.8322 10.7612 3.7685 4.0186 6.6672 7.9238 3.2766 1.2260 1.1575 4.5657 1.0901 1.0917 3.9096 1.3791 1.2689 3.5411 1.7206 1.7610 1.7926 2.7652 2.5243 2.7655 2.9856 2.8612 1.6954 2.2256 2.1713 2.1478 2.2229 1.4046 1.2450 1.2936 1.8226 2.4940 1.4345 1.1587 1.3875 1.1297 1.3826 1.1537 1.3105 1.2772 1.2932 1.2547 1.3840 1.2547 1.3643 1.2199 1.2219 1.2204 1.2443 2.8463 1.1104 1.1140 1.0408 1.0406 1.0802 1.0579 1.0515 1.0491 1.0657 1.0469 1.0688 1.0762 1.0798 1.0791 1.1082 5.6472 1.0363 1.0363 1.0557 1.0624 1.0607 1.0472 1.0445 1.0372 1.0619 1.0625 1.0932 1.0642 1.0955 1.1076 1.1024 1.1079 1.1003 1.1022 1.1004 1.0992 1.1019 1.0986 1.0982 1.1020 1.1019 1.1048
irintensity: 0.2277 0.1183 0.2265 2.4215 0.5794 0.2720 0.5576 0.6221 0.2033 4.0167 1.3116 0.3447 1.9164 2.3581 1.4184 0.9299 4.4797 16.3118 10.7217 0.9362 4.3629 2.9617 0.5981 0.5688 8.1930 1.5190 7.0214 13.0408 9.8084 15.7554 1.5850 24.6367 4.6127 7.9238 14.4249 4.6156 118.8416 10.1461 13.3379 101.7142 97.6169 31.9806 3.1088 9.7668 5.0075 2.5979 2.5339 175.5115 4.9456 4.2122 77.5391 24.8191 3.4217 4.4270 3.9625 137.5584 92.2429 0.7902 0.6322 23.9099 9.5500 16.9798 3.6574 3.9291 5.3983 2.3149 3.6018 71.9205 22.8912 28.2267 0.7555 3.2537 0.2198 21.9639 7.0568 14.0894 2.2178 27.2446 3.8496 5.9359 7.8265 3.9020 9.2090 15.3319 24.1893 26.0716 107.3142 22.2557 9.2916 12.6667 13.3703 3.9482 3.4292 6.9122 5.5733 7.7618 14.7544 2.9407 14.6330 6.7893 8.1105 23.4441 338.9255 32.7713 38.9288 30.5255 12.8625 0.2680 22.5430 28.6234 17.6581 77.9043 31.0943 1.2569 17.6553 2.7316 11.1864 7.3680 9.6135 13.8598 91.8488 51.4197 23.8839 62.7679 30.9485 29.1957 36.2568 32.1295 0.9307
temp: 298.150 k
press: 1.00000 atm
elementType: 16 16 15 8 8 8 7 6 6 6 6 6 6 6 6 6 6 6 6 1 1 1 1 1 1 1 1 1 1 1 1 1 1 1 1 1 1 1 1 1 1 1 1 1 1
symmnumber: 1
zpe: 978772.2 jmol-1
zpe.correction: 0.372795 hartree
zpe.thermalcorrener: 0.399878 hartree
zpe.thermalcorrenthalpy: 0.400822 hartree
zpe.thermalcorrgfe: 0.308735 hartree
zpe.sumelectzpe: -1889.090772 hartree
zpe.sumelectthermal: -1889.063689 hartree
zpe.sumelectthermalent: -1889.062745 hartree
zpe.sumelectthermalfe: -1889.154832 hartree
dipole: 3.0887 4.5662 5.4028
dipole: 7.7189
quadrupole: -132.7985 -135.6876 -144.4298
quadrupole: 1.9694 -5.7986 -9.4708
quadrupole: 4.8401 1.9511 -6.7911 1.9694 -5.7986 -9.4708
hfenergy: -1889.463567 hartree
pointgroup: C01 [X(C12H26N1O3P1S2)]
dipole: -0.9559888 -1.3473632 2.5481472 debye
polarizability: 285.8858357|3.2907855|199.0742157|-19.8807815|-16.205979|185.2961091 unknown
InChI: InChI=1S/C12H26NO3PS2/c1-5-9-13(10-6-2)12(14)11-19-17(18,15-7-3)16-8-4/h5-11H2,1-4H3
charge 0 multiplicity 1
45 atoms
S  0.755523 1.24491 -1.782631
S  4.431557 0.865376 -2.163456
P  2.761017 0.496956 -1.00269
O  -2.039352 1.510057 -1.712708
O  2.349627 -1.151634 -0.626765
O  2.854625 1.065133 0.656921
N  -2.702663 -0.006287 -0.072562
C  -4.127892 0.206844 -0.427448
C  -2.395665 -0.970719 1.008205
C  -4.78085 1.353453 0.378758
C  -2.260395 -2.431649 0.511526
C  -1.741703 0.694053 -0.778394
C  -0.280772 0.456563 -0.391076
C  -6.270337 1.528116 0.014288
C  -2.008068 -3.413163 1.675542
C  3.450169 -2.054075 -0.171221
C  3.438641 2.41531 0.891085
C  2.837754 -3.447466 -0.06718
C  3.517155 2.592488 2.405084
H  -4.176644 0.443376 -1.50477
H  -4.671919 -0.741969 -0.25421
H  -1.470394 -0.666928 1.53084
H  -3.20964 -0.911207 1.756585
H  -4.67926 1.150862 1.463996
H  -4.226479 2.286533 0.168242
H  -3.18274 -2.716946 -0.030897
H  -1.433421 -2.493348 -0.222088
H  -0.019277 0.954134 0.558273
H  -0.00756 -0.60692 -0.329959
H  -6.389795 1.759327 -1.060458
H  -6.72555 2.354825 0.588263
H  -6.849035 0.609475 0.229223
H  -1.07643 -3.162398 2.217397
H  -1.912594 -4.449363 1.305716
H  -2.838542 -3.391938 2.406255
H  4.26975 -2.016685 -0.914057
H  3.8243 -1.690463 0.804103
H  4.436806 2.462568 0.415294
H  2.783054 3.175959 0.423543
H  3.605214 -4.168484 0.270402
H  2.007214 -3.458519 0.660144
H  2.453298 -3.77762 -1.046934
H  3.943635 3.584596 2.643078
H  2.515226 2.525818 2.862702
H  4.160911 1.818154 2.855938
