program: Gaussian 09
title: 000216796
version: EM64L-G09RevD.01
frameworkgroup: C1[X(C12H11NO4)]
method: RPBEPBE
basis: SDD
operation: Freq
keyword: #p
keyword: freq=noraman
keyword: PBEPBE/SDD
title: #p freq=noraman PBEPBE/SDD
converged: YES YES NO NO
title: Mulliken charges:
elementType: O O O O N C C C C C C C C C C C C H H H H H H H H H H H
charge: -0.279864 -0.254752 -0.230346 -0.249944 0.103837 0.153603 0.156318 0.236927 0.252179 -0.366375 -0.508264 -0.791222 0.348637 -0.359394 -0.297796 -0.195109 -0.534466 0.245486 0.273599 0.251547 0.251176 0.237847 0.257344 0.290276 0.298244 0.228867 0.228870 0.252774
chargesum: 0.00000
title: Mulliken charges with hydrogens summed into heavy atoms:
elementType: O O O O N C C C C C C C C C C C C
charge: -0.279864 -0.254752 -0.230346 -0.249944 0.103837 0.153603 0.156318 0.236927 0.252179 -0.120888 -0.234665 -0.050652 0.348637 -0.102050 -0.007520 0.103136 0.176046
polarizability: 3.78784169e+02 -2.31042329e+01 1.79670047e+02 -2.72347884e-03 9.47272360e-03 6.83080334e+01
1716.lowfreq: -104.2639 -9.8552 -5.7696 -3.0948 -0.0010 -0.0004 0.0003 50.2900 51.4031
frequency: -104.2624 50.2869 51.3999 56.0434 78.3603 140.5820 160.0517 166.3787 200.4680 225.8381 227.0109 228.6487 269.4270 287.5860 307.6503 427.3503 433.1567 446.4940 446.5271 497.7484 564.3963 582.4651 618.1419 630.3791 642.0384 662.4328 683.0955 740.4859 747.3022 757.7732 819.6014 841.4117 844.9805 858.3918 914.3532 937.7677 957.4993 970.7684 982.5054 1036.0579 1051.3076 1063.1420 1111.4665 1112.2122 1143.5503 1159.3160 1198.5839 1214.8007 1221.3428 1257.1015 1272.0900 1298.5589 1359.6183 1387.1695 1393.6819 1406.7678 1433.6030 1448.1486 1467.5046 1470.3660 1470.8385 1471.3494 1495.2463 1543.9473 1580.7660 1627.6480 1644.3326 2968.1709 2987.4594 3060.1747 3064.8207 3096.5898 3135.4174 3142.9001 3149.3059 3178.0856 3187.0591 3215.0522
redmass: 1.0174 8.3780 7.9322 7.2915 3.4869 4.4034 4.0498 4.0475 2.0203 3.1534 1.4926 7.6484 5.8345 3.8128 4.5153 4.0062 6.3350 3.4791 4.0488 5.3953 5.9423 4.8288 5.3354 3.4955 5.3840 8.0138 8.4235 6.1866 3.6206 6.3215 1.4731 1.6223 1.7347 3.5087 5.2084 5.0815 1.3293 1.1807 3.8038 1.4819 2.1010 3.8513 1.2601 2.1718 1.3984 1.5424 3.4962 1.5854 4.4416 1.4242 1.7711 5.5015 4.8314 3.7297 3.2859 1.3639 1.2780 4.7269 1.0494 1.1308 1.1429 1.0786 2.7816 6.5916 7.8781 7.7277 7.2176 1.0327 1.0380 1.1044 1.0979 1.0982 1.1001 1.0897 1.0891 1.0962 1.0924 1.0950
irintensity: 0.5139 0.4172 0.2513 2.1788 6.3431 0.8822 4.2326 4.4214 3.8300 0.1447 0.0190 2.0981 2.0243 3.3152 1.2294 1.4033 17.4992 3.2619 3.1952 26.3373 1.4028 3.8490 1.9269 6.2334 11.1357 5.9391 1.3673 4.1790 0.0981 4.3950 28.1088 64.9933 17.9180 5.0797 1.3962 40.1442 0.0097 51.0137 46.4857 1.8924 98.7052 8.4526 0.1436 93.4499 13.6433 30.3095 681.6769 12.9061 505.2069 12.0686 38.0933 196.7232 33.4666 73.1045 71.7850 20.0546 9.3512 7.4856 15.1471 17.3329 20.8574 34.9163 29.5497 8.9410 56.5728 587.7734 207.1703 58.7169 16.8256 40.0635 10.4254 13.1229 21.2717 1.7890 5.9511 8.4358 3.5528 11.9801
temp: 298.150 k
press: 1.00000 atm
elementType: 8 8 8 8 7 6 6 6 6 6 6 6 6 6 6 6 6 1 1 1 1 1 1 1 1 1 1 1
symmnumber: 1
zpe: 544195.3 jmol-1
zpe.correction: 0.207273 hartree
zpe.thermalcorrener: 0.222174 hartree
zpe.thermalcorrenthalpy: 0.223118 hartree
zpe.thermalcorrgfe: 0.164303 hartree
zpe.sumelectzpe: -818.192023 hartree
zpe.sumelectthermal: -818.177122 hartree
zpe.sumelectthermalent: -818.176178 hartree
zpe.sumelectthermalfe: -818.234993 hartree
dipole: -8.4184 1.6972 0.0028
dipole: 8.5878
quadrupole: -132.9347 -83.4730 -100.4370
quadrupole: 18.9117 0.0046 0.0045
quadrupole: -27.3198 22.1419 5.1779 18.9117 0.0046 0.0045
hfenergy: -818.3992965 hartree
pointgroup: C01 [X(C12H11N1O4)]
dipole: 3.3278321 0.5840221 0.0003717 debye
polarizability: 379.8223226|18.0557051|178.6317997|0.1062294|0.0860779|68.3081273 unknown
InChI: InChI=1S/C12H11NO4/c1-8-10-4-3-9(16-2)7-12(10)17-11(8)5-6-13(14)15/h3-7H,1-2H3
charge 0 multiplicity 1
28 atoms
O  -0.300204 -0.707804 -0.000788
O  4.641829 -1.087655 0.000673
O  -5.212246 -2.04136 -0.003394
O  -5.303848 0.252022 -0.000713
N  -4.646738 -0.870219 -0.002029
C  1.076241 1.160568 0.001375
C  -0.291353 1.627775 0.001386
C  1.030765 -0.266273 0.000068
C  -1.103745 0.481861 0.000046
C  2.351161 1.79427 0.002402
C  2.15738 -1.098845 -0.00026
C  -0.761119 3.058094 0.0019
C  3.409227 -0.433916 0.000799
C  3.501253 0.996529 0.002118
C  -2.522447 0.34105 -0.000389
C  -3.199882 -0.851606 -0.00187
C  4.641745 -2.55579 -0.000646
H  2.440438 2.885243 0.003337
H  2.05579 -2.185742 -0.001243
H  -1.366376 3.288256 -0.894055
H  -1.385592 3.281625 0.886174
H  0.094026 3.753364 0.013632
H  4.501762 1.437918 0.002876
H  -3.118694 1.261592 0.000501
H  -2.745284 -1.842086 -0.003012
H  4.14621 -2.952869 -0.90702
H  4.145609 -2.9545 0.904682
H  5.703191 -2.841102 -0.000549
