program: Gaussian 09
title: 000216795
version: EM64L-G09RevD.01
frameworkgroup: C1[X(C13H11ClN2)]
method: RPBEPBE
basis: SDD
operation: Freq
keyword: #p
keyword: freq=noraman
keyword: PBEPBE/SDD
title: #p freq=noraman PBEPBE/SDD
converged: YES YES NO NO
title: Mulliken charges:
elementType: Cl N N C C C C C C C C C C C C C H H H H H H H H H H H
charge: -0.075985 -0.218771 -0.166910 0.412521 0.313033 -0.551126 -0.397022 -0.222243 -0.226635 0.358444 -0.619742 -0.368681 -0.358831 -0.232766 -0.232382 -0.105138 0.244973 0.254506 0.264422 0.258243 0.242343 0.242936 0.227752 0.231431 0.227161 0.249004 0.249466
chargesum: 0.00000
title: Mulliken charges with hydrogens summed into heavy atoms:
elementType: Cl N N C C C C C C C C C C C C C
charge: -0.075985 -0.218771 -0.166910 0.412521 0.313033 -0.306153 -0.142517 0.042179 0.031607 0.358444 0.093288 -0.137251 -0.131671 0.016239 0.017084 -0.105138
polarizability: 3.09174557e+02 5.20227460e+00 1.53672179e+02 1.11514419e+00 -2.71530860e+00 6.95671885e+01
1716.lowfreq: -0.0011 -0.0005 0.0012 0.4903 2.5354 9.8465 33.4802 46.8514 59.0749
frequency: 33.4288 46.8376 59.0645 79.1699 119.4894 151.3921 198.5232 232.9239 247.3126 282.8405 317.3256 354.6642 404.0319 407.7623 454.7085 499.1797 552.7025 565.7921 610.3813 624.5786 628.4117 653.3914 671.2015 686.1876 696.8126 710.1504 746.3784 781.3843 785.2027 816.4336 822.0033 835.4534 923.1681 947.5911 958.9218 995.5489 1005.0224 1035.4968 1073.4960 1078.0426 1102.7792 1106.8000 1123.2531 1185.7396 1193.9508 1195.9476 1252.0759 1271.0134 1294.6370 1314.1918 1332.1067 1377.7184 1401.8977 1406.4282 1419.9321 1447.5794 1463.6011 1468.0079 1493.8389 1532.4006 1548.6486 1574.5842 1604.9896 1618.9354 2974.7470 3049.8487 3108.9796 3139.5805 3143.8234 3167.2070 3171.0043 3230.9690 3242.2435 3244.0583 3274.7157
redmass: 3.5340 6.6907 1.1337 5.8124 4.3125 3.4839 4.6621 7.6595 7.4836 4.6040 4.6456 5.6978 4.2735 2.9067 8.5196 3.0831 3.2838 3.6087 4.0785 2.6230 2.5613 1.5340 1.4527 7.1504 2.9222 3.6606 2.0823 4.5651 1.3378 5.1381 1.2810 1.7809 5.7156 1.3591 1.3730 4.3702 1.9569 2.0358 2.6525 1.4569 2.2511 1.4157 1.2963 1.4410 1.6185 1.3205 1.7061 3.2971 1.3102 4.3153 3.6417 8.9165 3.7483 4.1771 3.2950 1.4009 1.0408 2.8052 1.0934 4.9312 4.7378 7.5632 6.1981 8.6116 1.0356 1.1021 1.0986 1.0885 1.0879 1.0958 1.0969 1.0969 1.0954 1.0946 1.1077
irintensity: 0.2840 0.5558 0.3924 0.5684 5.3421 0.4170 1.4350 0.9028 0.4614 0.1062 0.3665 2.1876 1.6875 0.0330 29.1085 15.6014 4.7918 1.8687 8.2043 3.1537 4.9180 30.3408 62.3778 5.5920 40.7168 0.6630 99.5506 25.8217 0.4380 5.1661 0.2685 53.8687 4.6223 0.0264 0.3056 27.2372 3.9728 8.0058 30.8139 15.1934 21.0850 19.1249 0.5267 10.5811 44.7756 15.6882 18.8886 1.2045 0.5943 12.9764 7.8086 3.2380 15.5733 6.8534 60.5847 8.9746 15.6049 36.0655 2.5575 115.4811 37.7846 9.3450 6.5895 137.6590 86.6578 29.2968 11.6474 9.3337 10.7493 13.3324 0.6136 1.5388 1.0055 2.0872 0.5158
temp: 298.150 k
press: 1.00000 atm
elementType: 17 7 7 6 6 6 6 6 6 6 6 6 6 6 6 6 1 1 1 1 1 1 1 1 1 1 1
symmnumber: 1
zpe: 541732.7 jmol-1
zpe.correction: 0.206335 hartree
zpe.thermalcorrener: 0.220102 hartree
zpe.thermalcorrenthalpy: 0.221046 hartree
zpe.thermalcorrgfe: 0.164192 hartree
zpe.sumelectzpe: -1070.407369 hartree
zpe.sumelectthermal: -1070.393602 hartree
zpe.sumelectthermalent: -1070.392658 hartree
zpe.sumelectthermalfe: -1070.449512 hartree
dipole: -6.5685 0.5881 0.0761
dipole: 6.5952
quadrupole: -89.6288 -84.0180 -107.1222
quadrupole: -5.7033 -0.4190 -0.2729
quadrupole: 3.9609 9.5717 -13.5325 -5.7033 -0.4190 -0.2729
hfenergy: -1070.6137041 hartree
pointgroup: C01 [X(C13H11Cl1N2)]
dipole: 2.584848 -0.2239563 0.0332687 debye
polarizability: 309.1453623|5.6791465|153.6064593|-0.4252206|3.9701569|69.6621029 unknown
InChI: InChI=1S/C13H11ClN2/c1-15-6-7-16-9-11(8-13(15)16)10-2-4-12(14)5-3-10/h2-9H,1H3
charge 0 multiplicity 1
27 atoms
Cl -5.991672 -0.283691 0.000359
N  2.223482 1.023209 -0.083025
N  3.706718 -0.669836 0.0718
C  2.339897 -0.379147 0.038061
C  0.13281 0.160734 -0.009009
C  1.062797 -0.951014 0.082829
C  0.871033 1.366214 -0.10967
C  3.512697 1.594162 -0.13114
C  4.415468 0.544643 -0.034257
C  -1.337937 0.055942 -0.003926
C  4.263826 -2.013458 0.198848
C  -1.987482 -1.184426 -0.263838
C  -2.161766 1.187771 0.261471
C  -3.39369 -1.298745 -0.261062
C  -3.568589 1.095821 0.259324
C  -4.167412 -0.151875 -0.001491
H  0.816378 -2.002522 0.207023
H  0.540972 2.392794 -0.239608
H  3.69077 2.659689 -0.225463
H  5.501448 0.572033 -0.032609
H  3.930819 -2.658062 -0.63602
H  3.952121 -2.482192 1.151059
H  5.363685 -1.957793 0.17976
H  -1.387783 -2.071989 -0.491049
H  -1.698392 2.152872 0.493217
H  -3.876814 -2.258865 -0.465099
H  -4.186483 1.974231 0.467118
