program: Gaussian 09
title: 000216787
version: EM64L-G09RevD.01
frameworkgroup: C1[X(C8H16N2O)]
method: RPBEPBE
basis: SDD
operation: Freq
keyword: #p
keyword: freq=noraman
keyword: PBEPBE/SDD
title: #p freq=noraman PBEPBE/SDD
converged: YES YES NO NO
title: Mulliken charges:
elementType: O N N C C C C C C C C H H H H H H H H H H H H H H H H
charge: -0.298319 -0.129553 -0.391876 0.237787 -0.472648 0.007838 -0.717217 -0.717951 -0.719556 0.201649 -0.613791 0.220818 0.203963 0.216307 0.199436 0.212356 0.235464 0.193745 0.227799 0.219783 0.209797 0.224570 0.233585 0.316857 0.210149 0.266918 0.222091
chargesum: 0.00000
title: Mulliken charges with hydrogens summed into heavy atoms:
elementType: O N N C C C C C C C C
charge: -0.298319 -0.129553 -0.075019 0.237787 -0.047867 0.224145 -0.069962 -0.076625 -0.051603 0.201649 0.085366
polarizability: 1.21791581e+02 -4.06989795e+00 1.11032498e+02 -1.53922597e+00 -5.66369670e-01 8.11382041e+01
1716.lowfreq: -31.5207 -0.0008 -0.0007 -0.0003 2.9918 7.1195 12.7379 73.1474 91.8620
frequency: -31.1711 73.1252 91.8566 137.6497 171.8393 178.7531 208.8979 210.3214 237.2408 261.8988 310.9586 323.9641 369.4371 415.5193 419.8986 445.9797 471.4482 486.5397 527.6725 619.8627 656.4039 773.6414 806.2114 837.3959 899.5952 914.4340 926.5002 942.6805 980.5880 992.4341 1038.8009 1079.6164 1085.9358 1123.4073 1144.7043 1155.6130 1176.7175 1191.8968 1225.7160 1232.7071 1271.7965 1293.7953 1328.1088 1359.7926 1369.6305 1386.7671 1391.0557 1426.1636 1438.7508 1453.1566 1456.8109 1461.1905 1465.7288 1469.3350 1476.1055 1484.3005 1486.0611 1510.8805 1672.2034 2957.7697 2973.2714 2975.7104 2979.5160 2985.9897 2989.8906 3049.0889 3049.4304 3070.9387 3078.2647 3086.3518 3089.1744 3091.8832 3095.8064 3104.0404 3600.8456
redmass: 1.0338 3.5395 3.3956 2.5463 3.0106 3.4079 1.0704 1.0587 1.4150 1.5693 2.4473 2.6180 2.8237 1.2195 2.7558 4.1435 2.7021 2.8246 3.0344 3.4281 10.8689 4.2931 3.2988 2.7829 2.1099 1.9945 1.5097 2.0166 1.8303 1.2831 1.6393 3.9903 2.1772 1.2890 1.8842 1.9257 2.1636 2.6649 2.5525 1.9998 1.9661 1.5647 1.2474 1.5315 1.2319 1.2146 1.2539 1.1490 1.0845 1.0553 1.1681 1.0476 1.0508 1.0608 1.0512 1.1818 1.1274 1.2699 9.4969 1.0435 1.0662 1.0443 1.0425 1.0590 1.0375 1.0952 1.0976 1.0996 1.0991 1.0997 1.0991 1.0989 1.1004 1.1002 1.0772
irintensity: 0.4384 1.9963 5.7037 0.3796 1.5907 2.7096 0.3143 0.1027 0.5092 0.2231 1.6457 1.7682 3.5920 104.7647 0.3755 14.9714 20.1599 2.7849 7.4364 6.6475 15.7787 2.7539 6.3132 10.8083 1.9330 24.8951 1.1960 18.2248 37.9050 0.3833 32.6808 76.1909 3.3988 24.1114 31.0266 20.6820 58.8826 52.4498 62.9792 15.9653 28.4923 31.6940 5.4525 17.1638 18.2791 15.0922 26.3421 25.4535 2.5910 2.5319 62.4081 11.1490 8.0377 5.3364 8.1582 19.0040 34.9001 80.5699 536.4372 104.3634 0.9453 42.7214 32.7127 34.3256 32.2934 29.4274 36.4009 28.0393 54.9076 8.1824 40.1135 49.8593 35.1014 11.7053 49.1897
temp: 298.150 k
press: 1.00000 atm
elementType: 8 7 7 6 6 6 6 6 6 6 6 1 1 1 1 1 1 1 1 1 1 1 1 1 1 1 1
symmnumber: 1
zpe: 613250.4 jmol-1
zpe.correction: 0.233575 hartree
zpe.thermalcorrener: 0.245688 hartree
zpe.thermalcorrenthalpy: 0.246632 hartree
zpe.thermalcorrgfe: 0.196436 hartree
zpe.sumelectzpe: -498.282403 hartree
zpe.sumelectthermal: -498.270290 hartree
zpe.sumelectthermalent: -498.269346 hartree
zpe.sumelectthermalfe: -498.319542 hartree
dipole: -0.6491 -1.1807 0.0890
dipole: 1.3503
quadrupole: -58.2633 -68.8321 -69.0166
quadrupole: -2.1329 -0.4853 -0.2215
quadrupole: 7.1074 -3.4614 -3.6460 -2.1329 -0.4853 -0.2215
hfenergy: -498.5159782 hartree
pointgroup: C01 [X(C8H16N2O1)]
dipole: 0.2318505 0.4774572 0.0221349 debye
polarizability: 122.1173235|-3.4624128|110.667269|2.160959|-0.3888369|81.1776901 unknown
InChI: InChI=1S/C8H16N2O/c1-6-5-8(2,3)10-7(9-4)11-6/h6,9H,5H2,1-4H3
charge 0 multiplicity 1
27 atoms
O  -0.276737 1.535415 -0.054419
N  -0.648903 -0.892118 0.034685
N  -2.399248 0.702371 -0.021595
C  0.810732 -1.201279 0.015083
C  1.647123 0.029619 -0.45196
C  1.175564 1.326403 0.228557
C  1.231907 -1.655618 1.439283
C  1.012888 -2.375383 -0.97232
C  1.882014 2.588111 -0.264679
C  -1.063263 0.342664 -0.00771
C  -3.470307 -0.287825 -0.113764
H  1.537556 0.152904 -1.547736
H  2.720385 -0.130612 -0.235294
H  1.277226 1.237575 1.330032
H  2.272955 -2.030262 1.442348
H  1.150912 -0.831258 2.170904
H  0.56431 -2.467107 1.777253
H  2.077363 -2.672228 -1.024662
H  0.416175 -3.244726 -0.645273
H  0.672207 -2.092075 -1.984158
H  2.958694 2.54398 -0.019312
H  1.773821 2.689768 -1.358871
H  1.451335 3.485907 0.211607
H  -2.600548 1.699061 -0.077925
H  -4.379376 0.095642 0.382174
H  -3.140583 -1.20952 0.392491
H  -3.718706 -0.550412 -1.162638
