program: Gaussian 09
title: 000211588
version: EM64L-G09RevD.01
frameworkgroup: C1[X(C24H28ClN3O)]
method: RPBEPBE
basis: SDD
operation: Freq
keyword: #p
keyword: freq=noraman
keyword: PBEPBE/SDD
title: #p freq=noraman PBEPBE/SDD
converged: NO YES NO NO
title: Mulliken charges:
elementType: Cl O N N N C C C C C C C C C C C C C C C C C C C C C C C C H H H H H H H H H H H H H H H H H H H H H H H H H H H H
charge: -0.065616 -0.287353 -0.109398 -0.200417 -0.040362 -0.045078 -0.021545 -0.414124 -0.358273 -0.687201 -0.683681 -0.699740 -0.703799 0.136214 0.175222 0.024621 -0.359952 0.335883 0.367767 -0.393754 -0.359223 -0.323547 -0.391904 -0.244474 -0.240468 -0.107220 -0.229641 -0.236654 -0.241135 0.202264 0.190759 0.243568 0.221583 0.233196 0.258638 0.210654 0.210304 0.219057 0.226164 0.209361 0.203213 0.211832 0.211515 0.232472 0.216938 0.200927 0.248122 0.234426 0.230756 0.287129 0.295472 0.224650 0.227391 0.229735 0.233782 0.231446 0.259498
chargesum: 0.00000
title: Mulliken charges with hydrogens summed into heavy atoms:
elementType: Cl O N N N C C C C C C C C C C C C C C C C C C C C C C C C
charge: -0.065616 -0.287353 -0.109398 -0.200417 -0.040362 0.157186 0.169214 0.051027 0.133561 -0.047186 -0.044943 -0.043921 -0.037812 0.136214 0.175222 0.024621 -0.125526 0.335883 0.367767 -0.162998 -0.072095 -0.028075 -0.167254 -0.017082 -0.010733 -0.107220 0.004141 -0.005208 0.018364
polarizability: 4.38339249e+02 -1.39731269e+01 4.58757819e+02 -2.42444328e+01 -1.03679401e+00 1.76488090e+02
1716.lowfreq: -3.5857 -0.0010 -0.0010 -0.0010 2.8730 4.7789 13.4451 16.1632 21.9276
frequency: 13.3419 16.0674 21.8865 27.8597 39.2692 44.2460 54.9873 63.1656 77.2401 78.5077 96.5567 104.0327 120.4246 146.5157 176.0837 187.1128 197.5035 198.8556 206.7540 236.4676 244.6495 263.1364 263.7692 272.9970 277.7331 296.5781 300.2585 321.2979 329.4225 354.4268 359.8385 381.1332 388.8886 395.8129 403.3769 430.1800 437.2912 461.7699 474.0339 500.3559 524.3291 545.5552 550.0235 588.5712 599.8799 614.9127 627.8006 647.8864 651.3258 689.3681 692.1643 696.1665 722.5725 746.9814 768.1016 782.0322 789.6058 790.6311 838.3244 840.7818 848.5010 881.7420 894.2927 901.5452 901.9720 906.8063 913.3772 919.7141 922.7809 928.7164 929.0356 975.2721 975.7624 977.1758 983.4134 988.3577 994.8997 997.9317 1022.2659 1029.0441 1070.8851 1074.1435 1077.0039 1089.6192 1095.7572 1099.6458 1117.4014 1124.8728 1133.5775 1155.3546 1163.9954 1175.4894 1184.7585 1201.9553 1214.4634 1227.7334 1238.1625 1246.2633 1287.0131 1293.9771 1297.8636 1306.2747 1312.1893 1316.4344 1326.4210 1335.0225 1354.2197 1359.9097 1367.5578 1373.1990 1376.4864 1377.6620 1383.8714 1384.7002 1391.8148 1396.9923 1408.6456 1433.8310 1435.5722 1458.9005 1464.0034 1466.8022 1468.1713 1469.5645 1471.9345 1475.8598 1476.6906 1485.1120 1487.8634 1488.5357 1492.5714 1556.8281 1570.6232 1577.6614 1593.5315 1606.9698 1610.2345 2939.1630 2971.9875 2972.7106 2978.8296 2979.6580 2980.6979 3000.5215 3046.4167 3058.9071 3064.8179 3065.8456 3073.2370 3073.7110 3078.3025 3080.6506 3088.0581 3091.6119 3123.7546 3133.4607 3135.4780 3140.5847 3146.4576 3158.3626 3162.7011 3165.7702 3178.6046 3182.9301 3188.6859
redmass: 4.1516 7.2452 4.1469 4.1714 3.3979 3.9741 4.3054 4.8042 5.1700 3.0855 3.5683 3.4797 6.4339 5.2614 4.4130 3.8079 2.7033 1.3521 1.1478 2.5626 3.2302 1.3594 1.1958 3.6339 2.3001 3.1345 4.8319 2.7634 4.9528 2.9138 3.4320 6.4590 4.0478 2.8088 2.8388 5.3109 3.4281 4.2302 3.5121 2.8773 4.2744 2.6353 5.2285 5.2256 5.8173 6.0920 4.8198 6.4081 5.4865 3.7129 2.4688 1.7682 3.1339 3.5220 1.9565 2.1276 2.1050 2.0016 2.4397 3.3446 1.5223 2.3712 1.4898 1.3989 1.2979 1.3767 4.0851 1.4925 1.3664 1.2861 1.6466 1.3734 1.5233 1.9258 5.2642 5.1682 4.8769 1.3748 2.2815 2.4683 3.2693 2.0375 1.9930 1.6453 1.6452 1.9613 2.2516 2.3327 2.2938 2.2859 2.0189 1.0550 1.1095 1.1416 2.8870 2.8400 3.6098 2.0353 1.4774 1.4041 1.3556 1.3315 1.3447 1.4081 1.3726 2.3506 1.8545 1.6104 1.2145 1.3591 5.1322 1.3127 5.3712 1.2686 1.2288 1.3104 3.4304 1.2576 2.3293 1.0486 1.0493 1.0796 1.1083 3.2307 2.6472 1.0542 1.0575 1.0702 1.0633 2.4751 1.0596 6.0441 6.6496 5.4477 8.1325 6.7613 5.9507 1.0675 1.0353 1.0347 1.0380 1.0598 1.0568 1.0843 1.0895 1.0616 1.0996 1.0994 1.0989 1.0991 1.0997 1.1004 1.1000 1.0990 1.0851 1.0884 1.1079 1.0868 1.0941 1.0932 1.0994 1.0906 1.0969 1.0932 1.0954
irintensity: 0.3529 0.3309 0.0996 0.7491 0.6820 0.0812 0.5530 0.1409 1.1459 0.3566 0.7824 2.2204 0.8816 2.0163 1.2061 0.9698 0.7040 0.5300 0.1563 0.5050 1.3399 0.4842 1.7402 3.7067 1.0001 1.5551 0.4039 0.4744 1.4053 0.4047 2.0112 5.7613 4.4406 5.9374 0.1299 15.5073 2.4776 4.5463 14.1637 10.1926 15.7768 11.1208 16.0165 9.6907 17.7869 3.8612 7.7895 9.5130 1.0763 33.6184 31.2513 35.9057 9.4317 9.7952 28.5717 23.8354 18.5944 66.8821 3.6066 13.8538 0.6484 2.1832 15.0325 3.3349 3.8688 2.0586 7.9215 7.1291 2.2230 2.9893 2.3647 0.3067 13.5504 13.3127 3.2033 0.1471 70.3897 1.2960 95.1227 32.6062 2.4553 47.9747 2.9602 10.6311 2.9139 30.1013 4.8706 41.6318 59.9659 115.5969 75.5626 0.0248 0.6086 6.3335 168.0710 45.1535 46.4874 15.9593 13.3995 17.3057 5.6375 2.3366 20.4299 37.1342 16.6366 29.3155 6.6221 12.7613 13.4905 17.8413 1.6540 25.8139 10.0518 6.6638 29.8929 48.0966 44.1757 6.9151 16.6091 1.2743 0.3930 3.6007 6.7812 7.3561 79.6873 5.7258 10.6035 8.1613 21.7898 13.3280 13.3223 224.6980 71.6570 2.9304 59.8484 31.9862 3.6248 24.5887 26.0171 28.1947 41.9553 30.6646 6.3220 31.7482 11.3327 20.2920 1.0069 0.8258 84.5104 81.2412 71.5471 32.7103 54.6330 28.6243 4.3913 3.5975 2.4791 11.9931 30.5719 4.7464 27.7253 21.1391 5.5980 3.9543 9.5469
temp: 298.150 k
press: 1.00000 atm
elementType: 17 8 7 7 7 6 6 6 6 6 6 6 6 6 6 6 6 6 6 6 6 6 6 6 6 6 6 6 6 1 1 1 1 1 1 1 1 1 1 1 1 1 1 1 1 1 1 1 1 1 1 1 1 1 1 1 1
symmnumber: 1
zpe: 1223528.3 jmol-1
zpe.correction: 0.466017 hartree
zpe.thermalcorrener: 0.494806 hartree
zpe.thermalcorrenthalpy: 0.495750 hartree
zpe.thermalcorrgfe: 0.402879 hartree
zpe.sumelectzpe: -1628.755365 hartree
zpe.sumelectthermal: -1628.726577 hartree
zpe.sumelectthermalent: -1628.725632 hartree
zpe.sumelectthermalfe: -1628.818503 hartree
dipole: -1.4271 0.9952 0.8930
dipole: 1.9556
quadrupole: -154.6192 -182.1074 -183.8126
quadrupole: -12.9619 -3.3770 1.7011
quadrupole: 18.8938 -8.5943 -10.2995 -12.9619 -3.3770 1.7011
hfenergy: -1629.2213824 hartree
pointgroup: C01 [X(C24H28Cl1N3O1)]
dipole: 0.6724578 0.049602 0.3705536 debye
polarizability: 456.302004|-10.6444524|437.6295992|30.5935574|-24.6087964|179.6535535 unknown
InChI: InChI=1S/C24H28ClN3O/c1-17(2)27(18(3)4)13-14-28-24(29)22(19-9-6-5-7-10-19)16-23(26-28)20-11-8-12-21(25)15-20/h5-12,15-18H,13-14H2,1-4H3
charge 0 multiplicity 1
57 atoms
Cl -1.042919 6.36201 -0.786894
O  0.161787 -2.477022 -0.322463
N  -3.955678 -1.250181 0.096204
N  -0.378541 -0.237799 -0.704986
N  -0.145783 1.109029 -0.7529
C  -4.990863 -0.205468 -0.096857
C  -4.345182 -2.620172 0.514189
C  -2.591471 -0.803311 0.350935
C  -1.775491 -0.642575 -0.97556
C  -5.790567 0.134635 1.194572
C  -5.951973 -0.539218 -1.264801
C  -4.199723 -2.884973 2.042038
C  -3.571402 -3.692931 -0.294335
C  0.558936 -1.266005 -0.345955
C  1.909647 -0.768941 -0.023183
C  1.106001 1.534331 -0.458399
C  2.138726 0.606282 -0.102263
C  2.981696 -1.711234 0.388541
C  1.327434 3.005497 -0.532164
C  4.0378 -1.265985 1.237185
C  3.005398 -3.062363 -0.062965
C  0.205105 3.876502 -0.616776
C  2.631388 3.571329 -0.526834
C  5.089553 -2.128786 1.603462
C  4.064478 -3.921241 0.299738
C  0.411678 5.261091 -0.684175
C  2.808948 4.969767 -0.595352
C  5.112162 -3.462223 1.130157
C  1.69744 5.838687 -0.672691
H  -4.433816 0.708365 -0.388331
H  -5.418941 -2.721256 0.26232
H  -2.05618 -1.533098 0.984163
H  -2.569645 0.172092 0.884076
H  -2.222754 0.135711 -1.613091
H  -1.760655 -1.609842 -1.498544
H  -6.46315 0.995868 1.022272
H  -6.414769 -0.722207 1.509013
H  -5.108389 0.389419 2.026234
H  -5.380589 -0.745125 -2.186757
H  -6.639837 0.305961 -1.453822
H  -6.573114 -1.426199 -1.039702
H  -4.59395 -3.886722 2.29648
H  -3.138879 -2.860736 2.353918
H  -4.75126 -2.133987 2.633604
H  -3.754454 -3.565731 -1.37616
H  -3.892314 -4.709805 0.000232
H  -2.481613 -3.619338 -0.118563
H  3.140682 0.987242 0.11093
H  4.018019 -0.249278 1.646295
H  2.186692 -3.430617 -0.684575
H  -0.800747 3.450855 -0.630837
H  3.517774 2.930878 -0.489572
H  5.883137 -1.767624 2.266965
H  4.066911 -4.954818 -0.063576
H  3.819659 5.39113 -0.594194
H  5.928284 -4.135379 1.415246
H  1.825716 6.923306 -0.724589
