program: Gaussian 09
title: 000216793
version: EM64L-G09RevD.01
frameworkgroup: C1[X(C11H14N4S)]
method: RPBEPBE
basis: SDD
operation: Freq
keyword: #p
keyword: freq=noraman
keyword: PBEPBE/SDD
title: #p freq=noraman PBEPBE/SDD
converged: YES YES NO NO
title: Mulliken charges:
elementType: S N N N N C C C C C C C C C C C H H H H H H H H H H H H H H
charge: 0.312611 -0.145182 -0.060899 -0.098243 0.022202 -0.387482 -0.376604 -0.365291 -0.380685 0.209936 -0.613566 0.299288 -0.444937 -0.148697 -0.400247 -0.590642 0.226023 0.223965 0.220217 0.264684 0.218116 0.189614 0.205292 0.216922 0.191754 0.224341 0.226955 0.248076 0.245021 0.267459
chargesum: 0.00000
title: Mulliken charges with hydrogens summed into heavy atoms:
elementType: S N N N N C C C C C C C C C C C
charge: 0.312611 -0.145182 -0.060899 -0.098243 0.022202 0.062506 0.108297 0.042439 0.041529 0.209936 0.029483 0.299288 -0.444937 0.099380 -0.155226 -0.323184
polarizability: 2.34184374e+02 9.54977033e+00 1.70466667e+02 1.41094976e+01 -7.90411723e+00 9.41455661e+01
1716.lowfreq: -2.2334 -0.0013 -0.0010 -0.0002 4.2937 11.4438 23.1248 57.2839 85.6713
frequency: 23.1071 57.2790 85.6670 145.3113 166.6761 196.0954 201.7298 234.6501 251.5313 288.9865 318.4318 329.6210 361.2744 392.1346 413.6660 452.1519 470.9495 491.8599 541.6301 569.6302 581.9361 610.8660 626.1009 681.5340 698.0975 737.3288 752.8573 784.3291 804.0342 840.6908 845.2756 881.1611 923.0779 931.4174 961.2117 1000.7354 1048.9820 1059.0637 1063.7702 1083.7272 1095.1395 1119.8325 1131.1783 1148.1959 1165.7362 1193.5688 1203.4194 1226.0536 1257.1250 1272.2112 1291.6732 1296.7546 1320.1071 1335.0481 1343.1328 1350.9438 1360.0671 1370.7366 1386.5057 1432.3242 1432.9564 1448.4377 1456.4984 1457.4070 1463.7009 1475.6259 1481.8418 1488.3679 1502.0017 1544.2431 2840.2669 2859.7055 2873.1552 2977.2661 2983.0257 3022.4070 3029.0088 3036.4373 3080.1475 3109.4314 3112.9438 3161.7193 3188.8166 3234.2968
redmass: 4.4359 3.9565 4.4983 3.9092 3.4409 9.1920 2.2588 1.3167 3.5618 3.1862 2.7423 2.4376 3.5783 4.2430 2.6723 3.9910 2.9219 5.1760 7.5552 3.7979 3.8866 3.6401 3.7614 6.8037 1.4735 6.9535 3.6667 5.8052 5.1213 1.6884 4.4101 1.3131 1.4499 2.1809 3.4130 2.5317 1.6984 2.4086 1.8022 1.9572 1.6788 1.7007 1.9228 2.5115 2.5290 4.1274 1.1186 2.3192 2.1687 1.7410 1.5805 1.4266 5.2828 3.7822 1.2688 1.3361 1.3622 1.4673 1.4602 1.1916 1.6404 1.5878 1.1133 1.1516 1.0618 1.1100 1.0554 6.8417 5.6209 6.4559 1.0702 1.0630 1.0630 1.0679 1.0676 1.0737 1.0883 1.0905 1.1010 1.0949 1.0937 1.0920 1.0909 1.1000
irintensity: 0.9435 0.5171 0.4978 0.4335 1.1937 1.6139 0.5802 0.4449 3.8539 6.8070 7.1866 4.6533 0.8953 2.1716 0.7828 3.8253 1.0456 2.1417 6.1355 1.9702 2.2684 1.3810 1.3891 8.7754 81.7223 17.5814 9.6302 0.8932 7.0217 3.3141 15.1393 1.1999 9.3166 3.1128 107.4140 54.5120 5.1220 4.3390 9.0443 18.0596 13.3673 30.1536 4.9061 27.2167 1.5638 1.3964 4.6389 2.6794 45.4746 17.8546 18.6491 33.7628 24.5613 118.0544 2.3648 4.9963 53.1875 16.1308 9.2647 9.7707 19.4104 21.3030 24.1639 74.8445 15.1751 18.2514 11.7866 108.9987 94.8279 508.7048 56.6289 51.3654 174.4230 28.5900 66.4134 47.7376 48.6504 57.1463 30.5640 4.9281 10.9440 22.3629 3.6935 2.0355
temp: 298.150 k
press: 1.00000 atm
elementType: 16 7 7 7 7 6 6 6 6 6 6 6 6 6 6 6 1 1 1 1 1 1 1 1 1 1 1 1 1 1
symmnumber: 1
zpe: 630839.0 jmol-1
zpe.correction: 0.240274 hartree
zpe.thermalcorrener: 0.254128 hartree
zpe.thermalcorrenthalpy: 0.255072 hartree
zpe.thermalcorrgfe: 0.198935 hartree
zpe.sumelectzpe: -1043.428363 hartree
zpe.sumelectthermal: -1043.414510 hartree
zpe.sumelectthermalent: -1043.413566 hartree
zpe.sumelectthermalfe: -1043.469702 hartree
dipole: 4.0208 -3.2066 0.3416
dipole: 5.1542
quadrupole: -104.0592 -96.9092 -104.4127
quadrupole: 7.9694 -5.1691 0.6173
quadrupole: -2.2655 4.8846 -2.6190 7.9694 -5.1691 0.6173
hfenergy: -1043.6686373 hartree
pointgroup: C01 [X(C11H14N4S1)]
dipole: -1.6858755 0.9479945 0.6092648 debye
polarizability: 229.9226248|22.592809|158.7085783|-14.4958937|30.3292028|110.1654041 unknown
InChI: InChI=1S/C11H14N4S/c1-14-3-5-15(6-4-14)10-9-2-7-16-11(9)13-8-12-10/h2,7-8H,3-6H2,1H3
charge 0 multiplicity 1
30 atoms
S  4.014389 1.325628 -0.246989
N  -0.894732 -0.252868 0.439334
N  -3.72998 0.173163 0.076811
N  0.617112 -1.637815 -0.706626
N  2.905099 -1.012338 -1.26369
C  -1.491193 1.067591 0.725259
C  -1.855351 -1.377405 0.538896
C  -2.76841 1.278074 -0.121996
C  -3.111963 -1.119197 -0.309975
C  0.389798 -0.453861 -0.037968
C  -5.015964 0.415525 -0.605844
C  1.48837 0.474616 0.145983
C  2.693948 0.115397 -0.53805
C  1.65277 1.675413 0.947053
C  1.834612 -1.856731 -1.267995
C  2.908006 2.237999 0.843873
H  -0.777827 1.86482 0.472618
H  -1.75443 1.138962 1.799925
H  -2.157575 -1.478734 1.600556
H  -1.343431 -2.291438 0.204596
H  -3.243679 2.227787 0.187952
H  -2.470505 1.379308 -1.198714
H  -2.83469 -1.138155 -1.3946
H  -3.841709 -1.930244 -0.129891
H  -4.91886 0.496569 -1.717894
H  -5.465289 1.352889 -0.231532
H  -5.714201 -0.410724 -0.382889
H  0.895213 2.088996 1.61413
H  1.965649 -2.809048 -1.79026
H  3.286923 3.12722 1.34493
