program: Gaussian 09
title: 000211585
version: EM64L-G09RevD.01
frameworkgroup: C1[X(C10H11ClN2O)]
method: RPBEPBE
basis: SDD
operation: Freq
keyword: #p
keyword: freq=noraman
keyword: PBEPBE/SDD
title: #p freq=noraman PBEPBE/SDD
converged: NO YES NO NO
title: Mulliken charges:
elementType: Cl O N N C C C C C C C C C C H H H H H H H H H H H
charge: -0.072621 -0.308576 -0.439800 -0.152765 0.304699 -0.304682 -0.464862 0.281449 0.225412 -0.361454 -0.204924 -0.781523 -0.234383 -0.266626 0.230609 0.230579 0.233780 0.233792 0.317933 0.326332 0.260822 0.260822 0.199043 0.231272 0.255673
chargesum: 0.00000
title: Mulliken charges with hydrogens summed into heavy atoms:
elementType: Cl O N N C C C C C C C C C C
charge: -0.072621 -0.308576 -0.121867 -0.152765 0.304699 0.156506 0.002710 0.281449 0.225412 -0.035122 -0.204924 -0.060836 -0.003111 -0.010953
polarizability: 2.13282059e+02 3.61468503e+00 1.37218667e+02 -2.21590002e-02 1.37289338e-02 6.55219031e+01
1716.lowfreq: -132.7204 -12.2969 -3.6078 -0.0017 -0.0016 0.0007 7.1585 36.9097 48.1499
frequency: -132.7148 36.8136 48.0871 63.4157 110.2077 115.4886 206.2241 213.5122 229.8721 279.1517 302.3636 311.5089 373.1913 481.8396 501.8165 535.2713 536.2425 571.3742 640.1203 652.9553 705.9284 713.5698 752.6667 786.2712 787.2785 816.0959 847.7389 876.1555 908.0680 920.0677 956.6491 985.6930 990.6237 1002.6116 1032.7308 1073.3462 1082.0126 1137.6849 1158.4867 1184.9358 1201.8376 1204.3698 1215.0053 1298.5559 1302.5282 1312.6355 1368.7693 1408.5877 1434.0413 1454.4828 1458.5439 1476.2858 1482.2332 1489.5615 1524.6975 1591.8653 1610.1345 1676.2129 2991.4337 3004.7372 3030.5136 3052.6859 3070.5731 3086.2718 3101.8059 3143.3374 3160.4114 3178.2535 3573.9603
redmass: 1.0442 2.5429 3.1001 6.2775 5.6609 3.9775 4.4777 9.4375 3.7791 4.9587 4.1018 5.2471 7.5315 3.9053 3.2222 1.5651 5.3963 3.0567 6.3032 7.2933 7.4760 2.9543 7.0537 1.4223 5.0087 1.1642 5.6091 6.5375 1.3472 3.6027 5.8125 5.5125 1.3026 1.8154 1.4759 2.1315 1.5780 2.0748 1.0969 2.4636 1.1014 1.8691 1.8174 1.6282 1.4845 1.3855 6.4613 1.2615 2.9142 2.0370 1.0421 1.1118 1.2348 1.0901 2.5048 3.4154 6.8742 8.9504 1.0375 1.0584 1.0579 1.1077 1.0980 1.0974 1.1115 1.0879 1.0949 1.0978 1.0747
irintensity: 0.8146 0.2292 1.0000 0.0506 1.3889 3.9212 1.8016 0.4185 1.8062 3.5003 16.3197 3.8155 9.7279 0.0528 1.5980 41.5382 2.0222 19.8703 35.3325 23.4387 14.7285 4.1256 13.7096 67.8453 2.3230 0.2715 28.2178 37.0249 3.4634 46.2672 72.5486 87.2486 3.2506 48.3754 6.8937 27.3311 0.0316 15.3817 0.5149 37.5299 0.1027 3.3450 14.4857 13.5679 16.9122 16.0417 22.4252 10.0925 159.0120 0.8232 13.9566 0.2328 6.8949 0.2197 232.2821 311.2481 87.7927 510.8980 22.8405 58.6341 80.0704 11.3005 10.2424 35.0427 39.5561 11.5210 14.8333 8.1925 52.6126
temp: 298.150 k
press: 1.00000 atm
elementType: 17 8 7 7 6 6 6 6 6 6 6 6 6 6 1 1 1 1 1 1 1 1 1 1 1
symmnumber: 1
zpe: 507410.4 jmol-1
zpe.correction: 0.193262 hartree
zpe.thermalcorrener: 0.205769 hartree
zpe.thermalcorrenthalpy: 0.206713 hartree
zpe.thermalcorrgfe: 0.152707 hartree
zpe.sumelectzpe: -1031.416420 hartree
zpe.sumelectthermal: -1031.403913 hartree
zpe.sumelectthermalent: -1031.402969 hartree
zpe.sumelectthermalfe: -1031.456976 hartree
dipole: 3.3811 -1.0216 0.0073
dipole: 3.5321
quadrupole: -78.6388 -84.2814 -91.5969
quadrupole: -1.6541 0.0482 -0.0013
quadrupole: 6.2002 0.5576 -6.7579 -1.6541 0.0482 -0.0013
hfenergy: -1031.6096822 hartree
pointgroup: C01 [X(C10H11Cl1N2O1)]
dipole: 1.3542816 0.3099418 -0.0299541 debye
dipolederiv: -0.7166597 0.2629861 0.0273494 0.3156935 -0.2914481 -0.0165476 0.0289286 -0.015015 -0.085271 -1.334015 -0.3061859 0.0204021 -0.2766648 -0.712409 -0.0105612 0.0224341 -0.0089307 -0.2569859 -2.2135929 0.0142712 0.0566487 0.0275396 -0.4168585 -0.0058053 0.0580608 -0.0059926 -0.3103288 -0.921874 0.1182898 0.0215405 0.5485109 -0.809253 -0.034564 0.0396165 -0.022007 -0.3613194 1.376271 0.2619916 -0.0262612 0.7279425 0.1454294 -0.0187664 -0.0072393 -0.0049245 0.0838623 0.6062352 0.0860682 -0.0044833 -0.2093468 0.0476622 -0.0059537 -0.0170086 -0.0151456 0.3515619 0.45115 -0.1609829 -0.0118096 -0.0908716 0.1947853 -0.0004652 -0.0089358 0.0017552 0.2737889 -0.6043218 -0.0812836 0.0127992 0.0830503 0.1556574 0.0052007 0.0188567 0.0094126 -0.0370767 2.4169129 -0.0126748 -0.0678091 -0.5253503 1.1870725 0.0565119 -0.0894082 0.0415315 0.1819746 -0.2634474 0.01743 0.0035699 -0.3670377 -0.1593574 0.0108298 -0.0120576 0.0002392 -0.1675733 1.0934509 -0.3290983 -0.0444878 -0.4172638 0.4027948 0.0296844 -0.0470544 0.0273633 -0.0767089 0.1051515 0.0875047 0.0020016 0.0871604 -0.1276473 -0.0093872 0.0016504 -0.0091549 0.056352 0.2085601 -0.0829241 -0.0127316 0.1145784 0.1278785 0.0073176 -0.0052997 0.0128212 -0.1469624 -0.3774803 0.1391514 0.0119075 0.0814957 -0.2399956 -0.0055947 0.0091925 -0.0073467 -0.1446345 -0.0725048 -0.0423849 -0.0691768 -0.0221606 0.0662227 -0.0424577 -0.1441636 -0.0614339 -0.0596522 -0.0586784 -0.0435364 0.0655172 -0.0306366 0.0566603 0.0543722 0.1423023 0.0744046 -0.0639079 -0.0567955 0.0674249 0.0593053 0.0245955 0.0246408 -0.0736308 0.1437156 -0.1117981 -0.0680925 -0.069711 0.0792918 -0.0531964 0.0412971 0.0091367 0.0774162 -0.140491 0.1129038 -0.0399239 0.2355969 -0.0251877 0.0011342 -0.0715079 0.1971784 -0.0019801 -0.0011572 -0.0031064 0.3002192 0.2061417 0.0602239 0.000912 0.068464 0.0927832 -0.0052108 0.0010683 -0.0050859 0.1739954 0.0554704 0.0513434 -0.0898941 0.0218852 0.0183029 0.0308712 -0.0696785 0.0766972 -0.0100555 0.064081 0.040414 0.0892281 0.0150588 0.0264157 -0.028893 0.0669202 -0.0761164 -0.0267135 -0.166391 -0.1421997 0.0018803 -0.0776406 0.047284 -0.000044 0.0043389 0.0016649 0.105524 0.0642186 0.0096807 0.0028832 -0.0172851 -0.1101544 -0.0096592 0.0018984 -0.0104897 0.154863 -0.0277684 -0.0696133 0.0027707 -0.0515062 0.0672185 -0.002683 0.0035106 -0.0022459 0.1730649 unknown
polarizability: 212.2937672|-8.6766393|137.9577478|-4.5446643|3.0621098|65.7711143 unknown
InChI: InChI=1S/C10H11ClN2O/c1-7-8(11)3-2-4-9(7)13-10-12-5-6-14-10/h2-4,13H,5-6H2,1H3
charge 0 multiplicity 1
25 atoms
Cl -4.485822 0.96923 0.161212
O  3.019586 1.2175 -0.03882
N  0.758855 0.717501 0.010636
N  2.433822 -1.055939 -0.113553
C  -0.480205 0.02676 0.01775
C  4.328595 0.494746 -0.11147
C  3.928309 -1.023824 -0.160687
C  -1.69106 0.793829 0.079761
C  2.029406 0.186172 -0.049714
C  -0.514235 -1.393163 -0.036357
C  -2.895962 0.053125 0.083708
C  -1.731573 2.312047 0.138367
C  -1.750145 -2.066384 -0.028852
C  -2.96519 -1.350219 0.031555
H  4.90774 0.768133 0.785673
H  4.848313 0.842149 -1.019333
H  4.279811 -1.51236 -1.086906
H  4.337998 -1.585698 0.697536
H  0.739415 1.73606 0.051582
H  0.432835 -1.936696 -0.083633
H  -2.298405 2.719111 -0.718221
H  -2.25081 2.651998 1.052423
H  -0.739355 2.79335 0.129826
H  -1.769636 -3.160419 -0.070444
H  -3.932187 -1.859509 0.037961
