program: Gaussian 09
title: 000211584
version: EM64L-G09RevD.01
frameworkgroup: C1[X(C11H14N2O)]
method: RPBEPBE
basis: SDD
operation: Freq
keyword: #p
keyword: freq=noraman
keyword: PBEPBE/SDD
title: #p freq=noraman PBEPBE/SDD
converged: NO YES NO NO
title: Mulliken charges:
elementType: O N N C C C C C C C C C C C H H H H H H H H H H H H H H
charge: -0.311993 -0.441221 -0.149955 0.082149 0.296655 0.414314 0.219696 -0.304755 -0.466175 -0.372218 -0.469985 -0.793940 -0.242562 -0.819480 0.313103 0.227353 0.227354 0.230993 0.230986 0.320785 0.229222 0.204268 0.238398 0.238111 0.222675 0.221895 0.232186 0.222138
chargesum: 0.00000
title: Mulliken charges with hydrogens summed into heavy atoms:
elementType: O N N C C C C C C C C C C C
charge: -0.311993 -0.128119 -0.149955 0.082149 0.296655 0.414314 0.219696 0.149953 -0.004196 -0.051433 -0.240764 -0.113162 -0.019887 -0.143260
polarizability: 2.08173077e+02 2.68354841e+00 1.40826118e+02 8.48585370e-03 -9.29292096e-03 7.21273749e+01
1716.lowfreq: -112.9566 -9.3051 -9.0406 -5.8008 0.0003 0.0003 0.0005 34.2492 49.1773
frequency: -112.9466 34.1197 48.9873 59.6578 115.2251 124.0835 176.3500 221.9507 240.0840 253.9534 297.6092 307.0379 338.4208 457.2910 505.7218 508.7537 531.0618 558.1337 576.1866 637.4758 700.9578 712.7494 729.7823 754.8709 795.7250 804.6300 815.9881 863.0696 896.2424 912.0112 918.4415 958.9210 982.6291 991.4089 991.6519 1019.1175 1047.1132 1070.4639 1082.5395 1095.4343 1158.5966 1176.7073 1194.8941 1200.3812 1202.2905 1264.5858 1298.8458 1302.2715 1311.9578 1371.4953 1395.0281 1410.1156 1439.1576 1458.0541 1460.1186 1474.2734 1478.0723 1479.8373 1490.5291 1492.3519 1535.3946 1602.7254 1613.3747 1680.1821 2965.0187 2973.2879 2999.9413 3025.9221 3035.1160 3044.0402 3045.8909 3070.6065 3082.1208 3095.3548 3122.3277 3145.4032 3164.0783 3578.2890
redmass: 1.0463 1.8856 3.5417 6.7573 4.3865 3.1162 1.1679 3.2874 2.6276 4.8181 5.1242 3.6441 2.9269 3.1932 2.8418 4.4374 1.4098 5.5056 3.0508 6.4634 6.4227 6.6479 2.6913 6.7573 1.3848 4.8365 1.1626 6.9551 2.8853 1.3385 3.3104 5.4780 4.9441 1.4563 1.3155 1.4239 1.6132 2.2229 1.5781 1.9780 1.0976 1.6094 3.5536 1.1011 1.7897 1.8595 1.8290 1.4744 1.3672 6.0304 1.2651 1.2648 1.9750 2.1101 1.0503 1.3221 1.1084 1.0453 1.1072 1.1919 2.0315 5.8657 4.5861 9.0523 1.0379 1.0387 1.0584 1.0579 1.0968 1.0975 1.1075 1.0957 1.0974 1.1112 1.0869 1.0940 1.0977 1.0745
irintensity: 0.7591 0.2726 1.9887 0.3618 1.5973 1.0842 2.9800 3.7601 0.1603 0.1090 4.6488 16.3062 2.9122 1.4596 3.4013 0.3328 47.5315 4.2366 11.1483 32.5251 10.8476 2.3695 3.7783 13.1370 61.9497 3.2176 0.2540 5.3638 26.5142 4.2235 42.6941 106.9502 66.6716 14.1498 1.7389 12.5791 1.5023 17.5548 0.0212 10.5542 0.4521 7.2976 15.6994 0.0911 26.0130 0.6617 11.2499 17.2790 15.3501 27.1168 0.5949 21.6716 50.6617 85.8360 1.2704 12.5406 0.1200 30.5656 2.5638 27.8545 265.2030 168.2699 50.5281 563.6639 50.3477 29.3759 63.2316 87.5147 36.4636 6.8817 12.3682 52.0708 16.7653 43.3689 11.2981 20.4682 22.9329 50.5365
temp: 298.150 k
press: 1.00000 atm
elementType: 8 7 7 6 6 6 6 6 6 6 6 6 6 6 1 1 1 1 1 1 1 1 1 1 1 1 1 1
symmnumber: 1
zpe: 603961.6 jmol-1
zpe.correction: 0.230037 hartree
zpe.thermalcorrener: 0.242879 hartree
zpe.thermalcorrenthalpy: 0.243823 hartree
zpe.thermalcorrgfe: 0.189614 hartree
zpe.sumelectzpe: -611.253182 hartree
zpe.sumelectthermal: -611.240340 hartree
zpe.sumelectthermalent: -611.239396 hartree
zpe.sumelectthermalfe: -611.293605 hartree
dipole: 0.8081 -1.9488 0.0013
dipole: 2.1097
quadrupole: -63.2981 -80.9642 -86.3693
quadrupole: 2.7499 -0.0029 -0.0030
quadrupole: 13.5792 -4.0870 -9.4921 2.7499 -0.0029 -0.0030
hfenergy: -611.4832187 hartree
pointgroup: C01 [X(C11H14N2O1)]
dipole: -0.3445518 -0.7548767 0.0198761 debye
polarizability: 207.8888543|-5.0601072|141.0645806|-1.2803157|-1.474113|72.1731348 unknown
InChI: InChI=1S/C11H14N2O/c1-8-4-3-5-10(9(8)2)13-11-12-6-7-14-11/h3-5,13H,6-7H2,1-2H3
charge 0 multiplicity 1
28 atoms
O  -3.017331 -1.21333 0.130824
N  -0.757585 -0.711435 0.09592
N  -2.437383 1.064256 0.073666
C  1.698897 -0.795151 0.072914
C  0.490192 -0.027677 0.068091
C  2.946588 -0.104015 0.044556
C  -2.025636 -0.177504 0.097054
C  -4.325643 -0.492724 0.128774
C  -3.931109 1.0282 0.090032
C  0.52756 1.391164 0.036066
C  2.973403 1.312099 0.012592
C  1.714545 -2.31833 0.106008
C  1.770959 2.050399 0.008634
C  4.255133 -0.877347 0.048408
H  -0.742655 -1.730201 0.117906
H  -4.86739 -0.7816 1.044789
H  -4.88719 -0.822568 -0.761101
H  -4.324727 1.533488 -0.81043
H  -4.306136 1.574003 0.974636
H  -0.414356 1.945455 0.033053
H  3.939541 1.829483 -0.009263
H  0.719102 -2.793598 0.135435
H  2.231538 -2.728698 -0.782656
H  2.26425 -2.689611 0.992134
H  1.79714 3.145634 -0.016008
H  4.33867 -1.554879 -0.823906
H  5.116325 -0.188318 0.020298
H  4.360299 -1.509097 0.952274
