program: Gaussian 09
title: 000211576
version: EM64L-G09RevD.01
frameworkgroup: C1[X(C13H8ClF2NO4S)]
method: RPBEPBE
basis: SDD
operation: Freq
keyword: #p
keyword: freq=noraman
keyword: PBEPBE/SDD
title: #p freq=noraman PBEPBE/SDD
converged: YES YES NO NO
title: Mulliken charges:
elementType: Cl S F F O O O O N C C C C C C C C C C C C C H H H H H H H H
charge: -0.047909 1.094592 -0.167671 -0.340635 -0.316150 -0.472673 -0.471624 -0.241830 -0.455582 -0.099142 0.243593 -0.324899 -0.212379 0.205672 -0.239200 0.517225 -0.431417 -0.353818 0.251111 -0.050230 -0.187864 -0.245140 0.318144 0.290277 0.323721 0.354454 0.258279 0.298771 0.239167 0.263154
chargesum: 0.00000
title: Mulliken charges with hydrogens summed into heavy atoms:
elementType: Cl S F F O O O O N C C C C C C C C C C C C C
charge: -0.047909 1.094592 -0.167671 -0.340635 -0.316150 -0.472673 -0.471624 -0.241830 -0.101128 -0.099142 0.243593 -0.006755 0.077898 0.205672 0.084521 0.517225 -0.173138 -0.055047 0.251111 -0.050230 0.051304 0.018015
polarizability: 3.79175487e+02 7.88369560e+00 1.96814764e+02 4.38432690e+00 8.50081053e-01 8.70169275e+01
1716.lowfreq: -5.6353 -1.7608 -0.0021 -0.0009 -0.0008 2.5901 11.5953 17.1203 28.2437
frequency: 10.9354 16.9039 28.2271 40.8568 58.1241 63.5778 99.5950 105.1179 139.4505 160.3043 164.3294 183.9745 210.5945 224.3080 229.1766 256.0507 276.9639 283.9490 302.7488 332.4701 364.5878 366.5184 410.5675 430.1879 438.3430 446.8968 467.7922 509.2717 540.6555 559.9436 570.5979 581.9868 641.5112 650.0688 673.5610 683.5046 701.1845 704.6832 721.5757 781.7017 792.6970 832.0918 837.6111 860.5057 866.2844 867.6694 869.1814 912.0947 950.2108 973.5453 980.4138 988.5266 996.1681 1055.5857 1075.6138 1097.9766 1107.1980 1141.3534 1179.5882 1183.8362 1232.5649 1244.7053 1257.6810 1309.1359 1377.4390 1387.9213 1405.7900 1413.4147 1470.7166 1476.1567 1516.7681 1585.9547 1588.6349 1595.0490 1611.5721 1705.8407 3146.9060 3152.1981 3169.6986 3175.2463 3181.1512 3198.8230 3212.3961 3535.9397
redmass: 10.9279 10.9629 7.8551 11.9452 10.6006 7.2210 9.7199 11.9100 12.2981 9.5074 9.0927 5.3885 9.6812 12.0106 10.8825 4.3403 10.3139 13.5330 12.8457 11.6970 7.8242 7.0359 8.5758 15.9805 3.0407 3.3898 6.3623 9.8217 10.5637 4.4480 7.1195 7.2770 7.7271 2.5967 7.7043 2.2914 1.9964 8.1638 3.9714 7.4750 1.3245 9.1733 1.3585 9.4214 6.1038 1.5758 1.4599 1.3709 8.8654 1.3118 5.9940 1.3214 18.2914 1.9506 2.1068 1.7488 2.4474 3.5173 1.8299 1.0884 2.5541 1.4797 1.9159 1.5064 6.2172 9.5524 3.7501 2.9182 2.8953 2.7101 2.1461 7.6376 6.4943 5.8663 6.5360 10.1427 1.0930 1.0889 1.0920 1.0938 1.0955 1.0957 1.0945 1.0765
irintensity: 0.0414 0.7325 0.6916 0.7592 7.3013 0.2986 1.5051 1.9604 1.3970 12.1091 0.8862 0.8856 2.5090 0.8316 2.0873 4.3450 12.6265 2.1316 2.0606 16.5369 2.2603 2.0971 8.9575 81.1165 7.5103 6.1768 10.3966 11.5670 103.0691 1.4828 48.0027 95.8498 8.1791 5.6704 16.1970 36.3314 76.1707 16.7407 4.6808 35.8303 53.9561 26.3109 38.8473 222.0287 21.4276 39.3519 51.3027 4.1633 262.1120 3.7826 6.5324 3.0331 75.4444 98.6335 31.4715 238.0671 164.8075 472.5626 48.6140 0.5605 303.0124 0.4606 175.7089 5.9033 99.9198 9.6822 29.5914 123.0041 549.9918 20.8951 355.8484 43.9979 164.4422 7.9560 109.3764 263.3553 3.7543 7.0990 4.3953 17.6443 1.9696 3.8112 12.8408 43.6562
temp: 298.150 k
press: 1.00000 atm
elementType: 17 16 9 9 8 8 8 8 7 6 6 6 6 6 6 6 6 6 6 6 6 6 1 1 1 1 1 1 1 1
symmnumber: 1
zpe: 496167.1 jmol-1
zpe.correction: 0.188980 hartree
zpe.thermalcorrener: 0.209625 hartree
zpe.thermalcorrenthalpy: 0.210570 hartree
zpe.thermalcorrgfe: 0.135273 hartree
zpe.sumelectzpe: -1911.903364 hartree
zpe.sumelectthermal: -1911.882718 hartree
zpe.sumelectthermalent: -1911.881774 hartree
zpe.sumelectthermalfe: -1911.957071 hartree
dipole: 6.6776 -0.4828 -0.6087
dipole: 6.7226
quadrupole: -188.4699 -136.6780 -146.2115
quadrupole: -8.8008 2.8907 0.0471
quadrupole: -31.3501 20.4418 10.9083 -8.8008 2.8907 0.0471
hfenergy: -1912.0923436 hartree
pointgroup: C01 [X(C13H8Cl1F2N1O4S1)]
dipole: -2.6210905 0.2440611 -0.2563021 debye
polarizability: 378.8326084|8.7740687|185.2736564|8.3126858|34.1482693|98.9009137 unknown
InChI: InChI=1S/C13H8ClF2NO4S/c14-8-2-1-3-9(6-8)17-13(18)21-12-5-4-10(7-11(12)15)22(16,19)20/h1-7,17H
charge 0 multiplicity 1
30 atoms
Cl -7.343842 -1.515973 -0.690487
S  5.89983 0.073902 0.144995
F  1.558782 -2.624741 -0.867391
F  6.11667 -0.48701 1.900838
O  -0.082538 -0.634826 -0.210724
O  6.611734 -1.042206 -0.765541
O  6.325567 1.622442 0.122095
O  -0.971859 1.472099 0.494653
N  -2.303596 -0.375087 -0.168881
C  4.046873 -0.097363 0.058527
C  1.280246 -0.346941 -0.082982
C  3.527073 -1.330056 -0.373204
C  3.256402 1.003066 0.421826
C  2.134097 -1.428265 -0.439747
C  1.852923 0.876098 0.345452
C  -3.635931 0.111753 -0.030302
C  -4.680445 -0.787959 -0.37018
C  -3.936862 1.422541 0.421598
C  -1.137756 0.303653 0.089416
C  -6.011259 -0.355477 -0.250623
C  -5.287864 1.815482 0.527648
C  -6.344829 0.937932 0.195106
H  4.164832 -2.172221 -0.657228
H  3.714387 1.94195 0.746105
H  1.20543 1.70986 0.617031
H  -2.18179 -1.336643 -0.497056
H  -4.460821 -1.802477 -0.720106
H  -3.131791 2.111852 0.681162
H  -5.523974 2.826087 0.876264
H  -7.389487 1.248032 0.27924
