program: Gaussian 09
title: 000216818
version: EM64L-G09RevD.01
frameworkgroup: C1[X(C14H10Cl2N2O4)]
method: RPBEPBE
basis: SDD
operation: Freq
keyword: #p
keyword: freq=noraman
keyword: PBEPBE/SDD
title: #p freq=noraman PBEPBE/SDD
converged: YES YES NO NO
title: Mulliken charges:
elementType: Cl Cl O O O O N N C C C C C C C C C C C C C C H H H H H H H H H H
charge: -0.034207 -0.033161 -0.286883 -0.282909 -0.244424 -0.235563 0.007919 0.004642 -0.314988 -0.230860 0.239312 0.220819 0.229056 0.220526 -0.198847 -0.198791 -0.400397 -0.401781 -0.059099 -0.070206 -0.328092 -0.330259 0.233362 0.255313 0.237998 0.249452 0.301909 0.330069 0.289050 0.286065 0.273135 0.271839
chargesum: 0.00000
title: Mulliken charges with hydrogens summed into heavy atoms:
elementType: Cl Cl O O O O N N C C C C C C C C C C C C C C
charge: -0.034207 -0.033161 -0.286883 -0.282909 -0.244424 -0.235563 0.007919 0.004642 0.173688 0.256590 0.239312 0.220819 0.229056 0.220526 0.103062 0.131278 -0.111347 -0.115716 -0.059099 -0.070206 -0.054956 -0.058420
polarizability: 2.06333325e+02 5.11180712e+00 2.30357397e+02 1.07452915e+01 1.69767843e+01 1.45954460e+02
1716.lowfreq: -5.7423 -0.0015 -0.0013 -0.0008 1.8468 3.8723 11.0249 13.5462 18.6526
frequency: 10.9543 13.4878 18.6022 47.5330 49.7904 56.6558 81.8875 108.3861 121.8988 161.7503 179.3345 182.7698 185.8467 205.9307 236.5866 281.9741 289.9754 327.6065 330.8344 337.7990 372.3866 381.3285 429.8280 440.1953 450.6041 462.1942 467.7955 489.0431 518.6852 627.6333 629.1082 689.6373 691.8577 702.4114 727.3525 730.3649 732.3877 791.2164 810.7537 857.5903 876.1927 899.0150 899.9955 937.2381 952.7604 954.4035 957.5502 982.5740 995.1154 999.8391 1020.9413 1047.2894 1069.3448 1086.4025 1091.1193 1108.4046 1153.1210 1157.9426 1208.3053 1221.5245 1238.2121 1264.6534 1298.6202 1302.5891 1310.7702 1310.8882 1354.6948 1373.0363 1404.7424 1405.2685 1420.2360 1420.7270 1441.7032 1456.5857 1529.5950 1530.3730 1571.1607 1572.3376 1629.1050 1633.2897 3010.6780 3039.6522 3081.2387 3116.2866 3155.1188 3155.5062 3161.2521 3163.0952 3168.5658 3191.9996
redmass: 12.1189 11.7187 9.7269 8.8113 10.6124 10.4438 11.7483 6.4674 5.2213 6.1535 4.8624 7.5580 3.8411 4.0147 7.1831 4.1846 7.5986 6.7727 4.4056 5.1259 9.4722 9.0146 4.4889 4.8499 4.4124 5.0178 5.2405 6.5998 3.5229 8.8611 9.3642 3.9591 3.9931 6.2813 3.5125 6.5351 3.9853 5.6039 4.3079 4.8098 6.0302 1.6242 1.5944 1.3664 1.4222 1.5080 1.4233 3.2185 5.2582 4.1952 2.7844 5.5534 5.6631 2.1739 2.1337 2.5004 2.2009 2.1899 1.1201 2.5104 2.6601 1.1552 1.3808 1.4421 7.7591 5.7762 1.3535 1.3990 2.1775 2.1697 2.6136 2.7399 1.1102 1.0847 6.7953 6.8897 6.2568 6.4719 11.8413 11.0416 1.0579 1.0597 1.1052 1.1078 1.0914 1.0919 1.0943 1.0943 1.0955 1.0940
irintensity: 0.0214 0.8688 0.3710 0.1881 1.2436 0.3177 0.7903 0.6777 0.5894 3.6796 2.2217 4.4951 0.4307 5.0440 3.6397 2.3068 1.1285 8.6296 12.2778 3.5778 4.2046 1.6294 2.7872 1.6728 5.6194 3.9349 17.1093 8.0534 7.8317 1.7218 1.6327 3.3944 4.5031 20.7451 37.3225 29.8799 48.3103 10.2276 1.1559 37.4763 22.8604 19.7483 18.6424 3.9635 0.7854 4.7241 10.5499 37.1249 57.0210 45.4602 3.9886 222.3236 202.8435 21.8661 27.0012 33.2899 43.7010 36.5729 4.7275 281.6349 327.6993 34.9437 14.0039 5.9626 7.8914 6.3734 6.3914 6.9253 32.0236 45.4000 5.0702 7.2283 25.5586 14.2233 49.7219 32.4417 27.2291 23.5819 153.7093 232.7587 15.6912 29.7149 18.4963 7.3067 5.1788 5.1395 0.5374 0.1206 18.2718 1.8881
temp: 298.150 k
press: 1.00000 atm
elementType: 17 17 8 8 8 8 7 7 6 6 6 6 6 6 6 6 6 6 6 6 6 6 1 1 1 1 1 1 1 1 1 1
symmnumber: 1
zpe: 571593.9 jmol-1
zpe.correction: 0.217709 hartree
zpe.thermalcorrener: 0.237858 hartree
zpe.thermalcorrenthalpy: 0.238802 hartree
zpe.thermalcorrgfe: 0.163550 hartree
zpe.sumelectzpe: -1868.429685 hartree
zpe.sumelectthermal: -1868.409536 hartree
zpe.sumelectthermalent: -1868.408592 hartree
zpe.sumelectthermalfe: -1868.483843 hartree
dipole: 2.1345 3.1377 -1.6274
dipole: 4.1292
quadrupole: -151.5613 -136.0095 -144.8303
quadrupole: 6.5872 5.7927 -11.6368
quadrupole: -7.4276 8.1242 -0.6966 6.5872 5.7927 -11.6368
hfenergy: -1868.6473939 hartree
pointgroup: C01 [X(C14H10Cl2N2O4)]
dipole: 0.8060517 -1.3977699 -0.1887532 debye
polarizability: 200.7089642|9.5096532|197.1336438|-15.9196636|43.6737353|184.8025744 unknown
InChI: InChI=1S/C14H10Cl2N2O4/c15-11-3-9(5-17-7-11)13(19)21-1-2-22-14(20)10-4-12(16)8-18-6-10/h3-8H,1-2H2
charge 0 multiplicity 1
32 atoms
Cl 5.338741 0.842559 -2.632208
Cl -2.289523 2.426445 2.858085
O  1.617249 -2.102284 -0.165756
O  -1.290777 -1.782831 -0.249396
O  0.928126 -0.974311 1.771624
O  -2.955056 -1.979293 -1.873123
N  3.665257 2.159707 0.853804
N  -4.785516 1.541321 -0.250426
C  0.627749 -3.183626 0.083709
C  -0.602462 -2.977905 -0.789289
C  2.630715 0.004644 0.331787
C  -3.023693 -0.155507 -0.242105
C  1.641507 -1.033955 0.744207
C  -2.464752 -1.376894 -0.88977
C  3.410509 -0.111836 -0.846793
C  -2.408965 0.446173 0.887485
C  2.792972 1.154814 1.148633
C  -4.205245 0.423972 -0.773113
C  4.30737 0.929004 -1.139416
C  -3.0171 1.597367 1.41548
C  4.415397 2.046807 -0.281335
C  -4.194164 2.121989 0.834793
H  1.144489 -4.116023 -0.195838
H  0.357067 -3.190308 1.153562
H  -1.276708 -3.85311 -0.731923
H  -0.338517 -2.802228 -1.847109
H  3.307261 -0.984871 -1.494659
H  -1.499735 0.020553 1.322535
H  2.201939 1.265147 2.063054
H  -4.694005 -0.026826 -1.64253
H  5.108817 2.864898 -0.501602
H  -4.673751 3.018906 1.240035
