program: Gaussian 09
title: 000211570
version: EM64L-G09RevD.01
frameworkgroup: C1[X(C20H25NO2)]
method: RPBEPBE
basis: SDD
operation: Freq
keyword: #p
keyword: freq=noraman
keyword: PBEPBE/SDD
title: #p freq=noraman PBEPBE/SDD
converged: YES YES NO NO
title: Mulliken charges:
elementType: O O N C C C C C C C C C C C C C C C C C C C C H H H H H H H H H H H H H H H H H H H H H H H H H
charge: -0.272112 -0.306061 -0.103459 -0.360606 -0.364921 -0.394090 -0.396806 -0.399928 -0.409197 0.016747 -0.741390 0.234838 0.136767 -0.342978 -0.337044 -0.262187 -0.236414 0.388828 -0.340982 -0.387837 -0.223494 -0.195561 -0.260050 0.214125 0.173520 0.180833 0.219915 0.203627 0.195691 0.196433 0.204338 0.190883 0.217528 0.208826 0.255121 0.224022 0.245463 0.233249 0.204854 0.307904 0.255116 0.223886 0.227605 0.251905 0.251924 0.222161 0.224441 0.224564
chargesum: 0.00000
title: Mulliken charges with hydrogens summed into heavy atoms:
elementType: O O N C C C C C C C C C C C C C C C C C C C C
charge: -0.272112 -0.306061 -0.103459 0.027038 0.035828 0.005228 0.003966 0.008483 0.054750 0.240769 -0.057823 0.234838 0.136767 -0.035074 -0.081928 -0.038301 -0.008809 0.388828 -0.089077 -0.135913 -0.001333 0.028880 -0.035486
polarizability: 2.64703178e+02 -3.05021350e+01 2.41251699e+02 -1.50090272e+01 2.43506192e+00 1.74363832e+02
1716.lowfreq: -6.7071 -3.8420 -3.4085 0.0004 0.0006 0.0007 19.0307 24.0885 29.9230
frequency: 18.8165 23.6185 29.5702 37.1427 42.5777 79.7961 87.7676 104.5129 127.0360 149.2457 183.6581 212.4306 231.2511 232.6871 255.5768 262.0250 291.0624 297.0094 310.7517 372.5373 377.9926 389.0639 410.8266 423.5191 447.1866 451.6952 464.5692 491.7902 510.0941 536.6708 554.9130 581.0637 592.0092 603.8897 618.1806 690.4863 720.0953 734.4504 750.7478 757.0170 766.3412 776.7334 804.2944 829.5875 843.7071 851.5905 854.1695 871.3892 876.8652 891.8239 896.3862 926.8090 943.9813 945.3633 958.4401 962.4038 980.6252 983.3001 985.3169 995.8212 1017.9594 1037.4535 1042.5762 1047.2342 1076.9363 1084.1783 1093.9355 1096.4823 1120.6378 1122.8433 1142.2231 1150.7077 1153.9295 1158.3454 1165.0935 1168.4609 1180.8959 1195.1912 1200.5134 1243.4175 1253.8219 1264.8165 1271.1316 1286.6253 1287.1778 1302.4500 1307.9144 1331.7050 1338.9367 1342.1857 1343.7649 1351.4691 1364.6002 1377.4544 1387.5170 1387.8946 1394.1697 1433.4779 1443.0430 1452.8110 1458.0823 1460.8260 1462.3133 1467.4014 1470.4727 1472.5692 1476.4430 1481.0050 1488.0658 1581.7226 1596.2416 1599.5482 1613.3655 2828.6542 2841.9506 2875.3283 2970.5253 2981.9595 2985.7132 2986.8908 2991.3946 3022.1859 3025.6332 3037.6741 3042.1445 3046.7142 3055.9442 3087.6566 3091.0299 3102.5940 3125.0239 3133.9893 3134.4347 3151.4106 3152.1160 3161.2846 3170.6305 3171.4973
redmass: 4.9129 4.4057 3.7889 3.6395 3.7277 4.6609 3.4802 3.4606 4.1128 3.9555 4.2790 3.2641 1.7370 1.2434 3.0264 3.1888 3.9954 3.9014 2.8431 4.3379 1.8507 2.6498 2.9393 2.9999 3.8481 3.0651 2.8509 3.0464 3.1494 3.9942 6.3854 2.3682 5.4033 5.5582 6.0159 2.2518 5.3269 3.2241 2.9478 1.5812 2.3096 2.2387 1.4766 1.2532 3.8802 2.8197 1.5387 1.7498 1.8282 2.5162 1.4506 2.5124 1.7505 1.3782 1.3148 1.3606 1.2922 1.3071 5.4875 2.4848 2.1015 2.0251 2.0005 2.1071 1.5127 1.6387 2.4353 1.8648 2.6477 2.0672 2.2405 1.4536 1.9955 1.5580 1.2337 1.1368 1.4218 1.9382 1.6025 3.3651 1.3401 1.2386 1.2660 1.4539 1.3823 1.3913 1.3301 1.2760 1.3699 1.4203 1.4218 1.4948 1.4121 6.1117 2.6842 2.2800 1.2682 2.3407 2.3334 1.0906 1.0510 1.0876 1.0804 1.0894 2.1935 1.0968 1.0569 1.1051 2.4535 6.6256 6.6392 6.5389 6.5338 1.0713 1.0706 1.0708 1.0626 1.0846 1.0617 1.0619 1.0366 1.0863 1.0899 1.0955 1.0886 1.1031 1.1038 1.0991 1.0937 1.1004 1.0846 1.0878 1.0890 1.0924 1.0928 1.0964 1.0992 1.0998
irintensity: 0.3666 0.1791 0.2537 0.1870 0.2398 1.0703 0.8358 0.9152 0.9101 0.3581 0.5728 0.2530 0.2242 0.0635 0.0636 0.5061 1.6866 1.2011 7.0569 2.4654 1.4428 1.5149 0.3101 13.2174 1.8198 2.1171 1.1106 11.5616 0.7590 2.1854 1.4392 0.1101 2.4228 0.5842 1.3876 26.5764 2.0451 19.2974 5.7607 125.6709 14.3466 45.7285 0.2127 0.3647 23.0384 10.6951 13.0346 3.0167 0.4785 34.6433 10.6333 38.4774 1.5384 8.3757 2.6436 0.1637 0.6573 3.3073 0.4920 20.3073 10.6449 54.1792 10.1393 8.5822 10.4586 2.6542 84.7417 11.7914 4.7108 42.0069 0.9830 4.0908 16.5598 13.6469 39.5222 24.6563 5.7614 151.0030 21.0792 280.5995 7.7386 3.5441 10.3431 45.9801 7.3616 6.5448 1.1976 2.3874 3.8151 0.6603 3.1043 1.8303 0.5907 24.5332 0.6478 4.9890 27.3659 28.3077 3.2640 7.5589 11.0683 17.5562 8.1823 9.7144 127.3166 6.5306 8.7583 6.8602 132.0550 22.7459 14.7898 51.8439 49.1090 57.5631 112.4617 118.0452 40.4217 25.0756 26.4655 25.6989 16.5405 63.5822 40.4054 45.7154 18.5136 23.4529 98.3334 31.4499 36.6932 26.2824 2.1520 1.1651 13.8810 30.0112 20.3391 18.7630 20.9920 8.2063
temp: 298.150 k
press: 1.00000 atm
elementType: 8 8 7 6 6 6 6 6 6 6 6 6 6 6 6 6 6 6 6 6 6 6 6 1 1 1 1 1 1 1 1 1 1 1 1 1 1 1 1 1 1 1 1 1 1 1 1 1
symmnumber: 1
zpe: 1062431.6 jmol-1
zpe.correction: 0.404659 hartree
zpe.thermalcorrener: 0.426009 hartree
zpe.thermalcorrenthalpy: 0.426953 hartree
zpe.thermalcorrgfe: 0.352118 hartree
zpe.sumelectzpe: -980.580880 hartree
zpe.sumelectthermal: -980.559530 hartree
zpe.sumelectthermalent: -980.558586 hartree
zpe.sumelectthermalfe: -980.633421 hartree
dipole: -3.6841 -1.5290 0.8719
dipole: 4.0829
quadrupole: -130.3098 -129.8910 -135.6480
quadrupole: -2.1667 1.5614 1.1930
quadrupole: 1.6398 2.0586 -3.6984 -2.1667 1.5614 1.1930
hfenergy: -980.9855388 hartree
pointgroup: C01 [X(C20H25N1O2)]
dipole: -1.5972107 -0.1710182 -0.0063296 debye
polarizability: 243.076585|0.1158202|173.5229785|-31.5507208|11.4214989|263.7191454 unknown
InChI: InChI=1S/C20H25NO2/c1-17(16-21-14-8-3-9-15-21)22-19-12-6-7-13-20(19)23-18-10-4-2-5-11-18/h2,4-7,10-13,17H,3,8-9,14-16H2,1H3
charge 0 multiplicity 1
48 atoms
O  0.536452 0.471406 -0.629179
O  3.237396 0.770228 -0.123569
N  -2.862572 0.868521 0.474769
C  -3.940282 0.147183 -0.255371
C  -3.417885 1.949514 1.335583
C  -4.960264 -0.471499 0.721654
C  -4.418204 1.380299 2.361206
C  -5.55468 0.611483 1.64975
C  -1.804786 1.367806 -0.439986
C  -0.892962 0.2231 -0.975191
C  -0.89188 0.0908 -2.499547
C  0.950498 0.288268 0.693702
C  2.354265 0.398179 0.92303
C  0.091307 0.012355 1.786698
C  2.881418 0.255011 2.218484
C  0.633458 -0.140374 3.084756
C  2.022101 -0.016513 3.309365
C  3.461834 -0.114294 -1.207002
C  3.096665 -1.479649 -1.187849
C  4.140099 0.442468 -2.314482
C  3.414038 -2.289272 -2.301885
C  4.451022 -0.379318 -3.418212
C  4.089278 -1.748427 -3.420515
H  -3.482232 -0.647725 -0.87305
H  -4.474428 0.842921 -0.956282
H  -3.931703 2.732831 0.718789
H  -2.57348 2.43966 1.855701
H  -4.449486 -1.242181 1.330832
H  -5.759519 -0.975845 0.145366
H  -4.827129 2.207966 2.971707
H  -3.87829 0.695363 3.04357
H  -6.157441 1.321978 1.046837
H  -6.23817 0.155479 2.390392
H  -2.239284 1.929692 -1.30339
H  -1.172183 2.080605 0.119082
H  -1.197684 -0.729056 -0.494101
H  -0.218845 -0.722406 -2.819028
H  -0.544092 1.029069 -2.966706
H  -1.912818 -0.123477 -2.86522
H  -0.993602 -0.047325 1.630359
H  3.962763 0.359896 2.351651
H  -0.041639 -0.348504 3.922433
H  2.435996 -0.127642 4.316749
H  2.580087 -1.901458 -0.319784
H  4.407825 1.503132 -2.293022
H  3.134491 -3.349125 -2.289869
H  4.97636 0.051142 -4.278277
H  4.333089 -2.383266 -4.279051
