program: Gaussian 09
title: 000211568
version: EM64L-G09RevD.01
frameworkgroup: C1[X(C13H8BrNO4)]
method: RPBEPBE
basis: SDD
operation: Freq
keyword: #p
keyword: freq=noraman
keyword: PBEPBE/SDD
title: #p freq=noraman PBEPBE/SDD
converged: YES YES NO NO
title: Mulliken charges:
elementType: Br O O O O N C C C C C C C C C C C C C H H H H H H H H
charge: 0.038230 -0.224116 -0.241977 -0.206574 -0.192267 0.050641 0.313595 0.391686 0.108116 -0.290040 -0.345247 -0.259370 -0.326227 -0.340169 0.272270 -0.302836 -0.195739 -0.188704 -0.214286 0.290518 0.277661 0.249487 0.234026 0.287126 0.297609 0.258259 0.258328
chargesum: 0.00000
title: Mulliken charges with hydrogens summed into heavy atoms:
elementType: Br O O O O N C C C C C C C C C C C C C
charge: 0.038230 -0.224116 -0.241977 -0.206574 -0.192267 0.050641 0.313595 0.391686 0.108116 0.000478 -0.067586 -0.009883 -0.092202 -0.053043 0.272270 -0.005226 0.062519 0.069624 -0.214286
polarizability: 4.28550906e+02 -4.45374828e+00 2.12127791e+02 6.61943005e-01 -4.09069938e-01 6.41543253e+01
1716.lowfreq: 0.0002 0.0002 0.0005 1.7395 2.3787 3.7121 20.3719 26.9457 28.3883
frequency: 20.3557 26.9402 28.3823 56.8818 78.6131 99.3448 104.0078 164.7501 175.2852 175.5879 192.9621 246.8127 262.8622 279.2462 344.8247 356.7038 404.2485 413.1035 462.2161 474.9298 495.1065 538.4336 563.9478 621.2278 629.9391 659.8078 679.8230 686.5898 721.4737 740.2495 745.8437 816.1327 831.2409 848.7002 855.2299 899.2509 908.8243 908.9696 924.2630 964.6594 991.6702 994.7072 1000.9975 1022.1557 1027.4468 1061.0555 1115.0743 1132.9596 1175.8880 1189.3120 1212.8962 1226.1592 1275.2095 1283.3527 1292.1574 1321.7369 1349.5676 1364.9577 1373.7289 1397.1638 1470.4141 1484.0369 1511.2546 1540.3416 1572.5135 1590.6633 1640.6896 3128.1941 3153.8397 3155.7542 3169.6269 3175.2664 3179.8747 3231.0725 3259.9465
redmass: 4.5894 6.2187 13.1117 12.5094 9.7197 6.4520 10.0165 3.5304 12.7767 6.5808 8.2763 8.6911 5.2180 8.0950 3.7250 5.9146 2.8364 9.7060 7.8252 3.3701 7.5084 4.7453 5.4445 7.1355 3.7230 8.5240 7.2017 5.0463 8.5866 3.0631 8.8754 1.3129 1.3629 4.8263 1.4726 1.9546 6.5060 1.5572 6.3990 1.3751 5.0902 1.1347 1.3650 3.6913 1.2456 2.5553 1.3932 4.0198 2.0125 1.2091 3.2196 1.8270 1.9670 3.1180 2.1062 1.5834 8.3986 4.5902 3.9772 3.9175 2.5853 6.4320 10.6443 5.9781 7.4729 6.0761 6.4236 1.0908 1.0894 1.0888 1.0910 1.0960 1.0960 1.0965 1.1032
irintensity: 2.4258 1.4409 1.1544 0.4974 4.9996 0.2467 2.8112 2.1819 2.4651 0.0463 4.1405 0.0586 0.5793 1.6625 2.3254 15.0636 0.0111 3.5008 15.2033 17.3543 6.1299 8.8520 0.9520 2.6779 7.0357 8.3157 14.2157 0.0191 24.2442 5.3713 25.9483 95.1937 1.6010 19.6225 32.4348 0.1767 11.7170 6.0273 1.0906 2.9871 135.8397 53.6882 1.7051 54.6793 31.3435 88.2403 17.7829 43.6156 4.9069 150.6485 505.5042 28.3278 146.8711 54.8358 78.0726 16.5113 151.3018 33.2447 23.1644 23.1377 63.0002 206.7505 101.2270 67.2719 18.8397 256.8650 83.6350 0.8417 3.2339 0.6000 2.7383 10.7083 2.8115 0.4463 6.1030
temp: 298.150 k
press: 1.00000 atm
elementType: 35 8 8 8 8 7 6 6 6 6 6 6 6 6 6 6 6 6 6 1 1 1 1 1 1 1 1
symmnumber: 1
zpe: 475392.7 jmol-1
zpe.correction: 0.181068 hartree
zpe.thermalcorrener: 0.197758 hartree
zpe.thermalcorrenthalpy: 0.198703 hartree
zpe.thermalcorrgfe: 0.132345 hartree
zpe.sumelectzpe: -867.838082 hartree
zpe.sumelectthermal: -867.821391 hartree
zpe.sumelectthermalent: -867.820447 hartree
zpe.sumelectthermalfe: -867.886804 hartree
dipole: 0.1098 3.3010 0.0590
dipole: 3.3034
quadrupole: -118.7333 -128.6722 -120.4102
quadrupole: 26.9394 0.4109 -0.2595
quadrupole: 3.8720 -6.0670 2.1950 26.9394 0.4109 -0.2595
hfenergy: -868.0191492 hartree
pointgroup: C01 [X(C13H8Br1N1O4)]
dipole: 0.1136936 -1.2912599 -0.0939549 debye
polarizability: 426.3787357|21.9883624|213.0051481|-4.2374665|13.3086782|65.4491392 unknown
InChI: InChI=1S/C13H8BrNO4/c14-10-3-1-9(2-4-10)12(16)7-5-11-6-8-13(19-11)15(17)18/h1-8H
charge 0 multiplicity 1
27 atoms
Br 6.594566 2.171553 0.121761
O  -2.649346 0.187896 0.080556
O  1.594595 -2.669308 -0.241437
O  -5.886795 1.709042 0.258528
O  -3.782984 2.643645 0.295541
N  -4.590264 1.637206 0.22998
C  2.634525 -0.501242 -0.058995
C  -2.391197 -1.201624 -0.03467
C  1.440686 -1.407466 -0.122397
C  -1.025369 -1.643247 -0.0941
C  -3.615416 -1.891294 -0.068823
C  0.07365 -0.823316 -0.047576
C  2.548848 0.909077 0.102218
C  3.921032 -1.099181 -0.163604
C  -4.03814 0.315248 0.114795
C  -4.665454 -0.925194 0.02753
C  3.71387 1.702914 0.157377
C  5.091929 -0.321942 -0.111677
C  4.973897 1.07763 0.048979
H  -0.858525 -2.724483 -0.18459
H  -3.726881 -2.970437 -0.153678
H  -0.063769 0.258021 0.040459
H  1.582355 1.413588 0.190412
H  3.975205 -2.18574 -0.285887
H  -5.739014 -1.092899 0.033237
H  3.640654 2.786714 0.282361
H  6.076644 -0.790161 -0.194299
