program: Gaussian 09
title: 000216801
version: EM64L-G09RevD.01
frameworkgroup: C1[X(C14H18N3O4)]
method: RPBEPBE
basis: SDD
operation: Freq
keyword: #p
keyword: freq=noraman
keyword: PBEPBE/SDD
title: #p freq=noraman PBEPBE/SDD
converged: YES YES NO NO
title: Mulliken charges:
elementType: O O O O N N N C C C C C C C C C C C C C C H H H H H H H H H H H H H H H H H H
charge: -0.139134 -0.262583 -0.269448 -0.154525 -0.027599 0.104449 -0.420587 -0.578328 -0.381144 0.550303 -0.505037 -0.416317 0.239837 -0.299223 0.226308 -0.323117 0.428262 0.263254 -0.490090 -0.532078 -0.778752 0.240993 0.268120 0.288937 0.252856 0.267445 0.236819 0.317554 0.257119 0.359451 0.249365 0.236296 0.244275 0.236959 0.262070 0.239233 0.245950 0.293406 0.268700
chargesum: 1.00000
title: Mulliken charges with hydrogens summed into heavy atoms:
elementType: O O O O N N N C C C C C C C C C C C C C C
charge: -0.139134 -0.262583 -0.269448 -0.154525 -0.027599 0.104449 -0.061136 -0.069215 0.160650 0.550303 -0.237592 -0.179499 0.239837 0.018331 0.226308 -0.065998 0.428262 0.263254 0.239845 0.206185 0.029305
polarizability: 4.60971457e+02 -3.45592652e+01 2.21086696e+02 2.65872948e+00 2.10771597e+00 1.23467546e+02
1716.lowfreq: -10.6548 -8.0406 -3.5517 0.0001 0.0005 0.0007 8.5796 17.8451 23.4764
frequency: 7.8336 17.8257 23.3161 38.0657 45.4567 48.6598 64.6980 90.3224 101.6835 116.5741 135.2221 154.9453 183.8397 197.3447 216.6577 231.1601 239.0312 278.6219 285.1558 321.9150 331.0564 343.5363 372.9072 400.6666 432.1769 452.8563 464.1811 480.5932 540.9390 555.9542 569.8900 604.7215 617.2270 623.4109 634.0746 655.1685 692.8400 712.7417 721.7150 745.1856 758.5496 797.0910 809.8192 849.1582 870.4392 882.5545 905.0669 925.1417 930.2684 942.6532 966.6016 968.9419 988.1550 994.4173 1021.0105 1037.4579 1086.4522 1105.8938 1108.6830 1119.6720 1141.2150 1144.6358 1155.7566 1159.3118 1181.7924 1193.5343 1221.7980 1243.7950 1266.2534 1275.5328 1299.5687 1328.9818 1356.0573 1378.3230 1390.9095 1392.0314 1409.5259 1427.3909 1434.5522 1450.7559 1455.7711 1458.0207 1459.2500 1461.6772 1465.4700 1468.5800 1468.8829 1469.8201 1498.9468 1559.1352 1602.7821 1607.9010 1685.8222 2979.8460 2994.8150 3008.1734 3011.8267 3047.1042 3071.0696 3077.9718 3078.8979 3120.2122 3125.5523 3130.4225 3143.8438 3144.8590 3145.4947 3146.1354 3173.8876 3266.3892 3520.5113
redmass: 5.5566 4.8249 3.8110 3.4433 3.3572 1.4541 2.9963 4.5982 4.5611 4.8367 3.8458 2.4207 1.6002 3.4174 3.6546 2.0337 1.4974 3.3788 4.5773 3.5858 3.2463 3.9788 4.0627 4.0824 3.9915 4.3761 3.9252 3.9532 3.9020 2.3087 3.3703 3.8733 2.2528 4.4319 3.1690 2.7944 4.5812 4.5443 3.6144 2.7791 2.4255 2.0033 2.8699 4.3371 4.7896 1.6193 2.6395 2.1317 1.9660 2.7827 7.0436 2.5182 3.1269 4.9518 2.2921 1.6776 3.5961 1.2431 1.2551 1.7805 1.3542 1.4026 1.6434 1.9900 1.7706 1.2643 2.1898 2.5792 1.8790 1.9308 1.5466 1.8655 1.9873 2.0511 1.2367 4.8793 2.4653 1.4297 1.1929 1.4392 1.1311 1.0578 1.0625 1.1098 1.0618 1.1084 1.1208 1.0559 2.7469 6.8943 6.5042 8.0410 7.5084 1.0320 1.0394 1.0604 1.0289 1.0610 1.1012 1.1052 1.0979 1.1082 1.1048 1.0899 1.0982 1.1010 1.1056 1.0925 1.0938 1.1020 1.0779
irintensity: 1.4546 0.2160 9.2492 2.3297 9.8016 3.1858 0.2788 6.5499 1.7655 4.5237 2.5966 3.1661 0.0440 2.4425 2.4059 3.9364 1.1667 1.2883 0.1231 2.0712 12.5998 3.5627 8.3616 1.9373 4.1930 4.6263 3.9653 1.5379 5.4901 26.6848 64.3001 19.5568 98.2853 48.4859 25.8627 25.4906 8.5648 2.7282 3.5924 17.5706 39.9913 18.4793 45.0958 1.2299 80.0900 57.3465 45.2562 6.5841 12.3984 20.6650 63.0730 94.2463 44.2347 38.9054 10.5148 17.0727 181.3529 0.5202 0.0597 50.0657 87.0197 7.6632 25.2357 331.7562 25.5371 49.2998 54.6157 240.5816 245.5579 262.4929 93.1655 34.5056 52.6245 61.2747 76.6339 18.2853 40.7184 73.3963 29.4388 10.4526 16.0950 40.9105 12.5012 11.2838 36.9837 62.0526 46.4008 32.3349 282.5277 418.1868 178.0983 696.8611 166.2088 44.7821 3.3358 12.4209 52.5923 11.0730 6.7051 25.4768 5.1710 1.0783 23.5867 5.4114 1.3076 10.8290 26.1100 1.2176 6.3575 23.0254 133.5697
temp: 298.150 k
press: 1.00000 atm
elementType: 8 8 8 8 7 7 7 6 6 6 6 6 6 6 6 6 6 6 6 6 6 1 1 1 1 1 1 1 1 1 1 1 1 1 1 1 1 1 1
symmnumber: 1
zpe: 804602.2 jmol-1
zpe.correction: 0.306457 hartree
zpe.thermalcorrener: 0.328237 hartree
zpe.thermalcorrenthalpy: 0.329181 hartree
zpe.thermalcorrgfe: 0.250930 hartree
zpe.sumelectzpe: -1007.529696 hartree
zpe.sumelectthermal: -1007.507916 hartree
zpe.sumelectthermalent: -1007.506972 hartree
zpe.sumelectthermalfe: -1007.585223 hartree
dipole: 8.0362 -4.4036 2.4258
dipole: 9.4793
quadrupole: -23.0777 -85.5959 -119.7563
quadrupole: -21.5281 5.7722 2.1164
quadrupole: 53.0656 -9.4526 -43.6130 -21.5281 5.7722 2.1164
hfenergy: -1007.8361526 hartree
pointgroup: C01 [X(C14H18N3O4)]
dipole: 3.0019967 -1.7703069 1.3277242 debye
polarizability: 455.1373913|-41.116269|223.3265621|34.4226639|-7.4004867|127.0617461 unknown
InChI: InChI=1S/C14H18N3O4/c1-10(18)15-14-9-17(16-21-14)7-6-11-4-5-12(19-2)13(8-11)20-3/h4-5,8-9,15H,6-7H2,1-3H3
charge 1 multiplicity 1
39 atoms
O  2.289211 0.034077 -0.670404
O  -4.279047 -0.54146 -1.317855
O  -3.531085 2.134592 -0.453214
O  3.946497 2.138676 -0.152907
N  1.469146 -1.963341 -0.170614
N  1.100786 -0.806958 -0.807883
N  4.481421 -0.097226 0.321815
C  -0.581905 -2.540697 1.158929
C  0.418626 -2.983307 0.032431
C  -1.364799 -1.301308 0.785735
C  -2.48793 -1.399161 -0.064493
C  -0.970415 -0.015594 1.249305
C  -3.222898 -0.261579 -0.46946
C  2.738191 -1.921174 0.389761
C  -2.801137 1.038658 -0.00312
C  -1.686785 1.134657 0.863054
C  3.257968 -0.666759 0.071416
C  4.81558 1.309516 0.176966
C  -5.362456 0.420491 -1.631731
C  -3.115427 3.480763 -0.022467
C  6.275243 1.602097 0.454859
H  -0.021768 -2.39943 2.101083
H  -1.254155 -3.406207 1.304425
H  -0.119089 -3.10218 -0.922178
H  0.92058 -3.930714 0.287453
H  -2.84722 -2.368537 -0.427694
H  -0.126205 0.086448 1.941137
H  3.162549 -2.747064 0.950679
H  -1.367897 2.112432 1.233472
H  5.214344 -0.723249 0.669224
H  -4.983555 1.249187 -2.248312
H  -5.814495 0.815889 -0.707411
H  -6.091771 -0.183245 -2.191028
H  -3.194449 3.585027 1.075385
H  -3.821619 4.163454 -0.514591
H  -2.084475 3.698647 -0.356786
H  6.613009 1.168356 1.413646
H  6.419382 2.691004 0.487235
H  6.912848 1.191418 -0.350261
