program: Gaussian 09
title: 000216829
version: EM64L-G09RevD.01
frameworkgroup: C1[X(C12H26NO3PS2)]
method: RPBEPBE
basis: SDD
operation: Freq
keyword: #p
keyword: freq=noraman
keyword: PBEPBE/SDD
title: #p freq=noraman PBEPBE/SDD
converged: NO YES NO NO
title: Mulliken charges:
elementType: S S P O O O N C C C C C C C C C C C C H H H H H H H H H H H H H H H H H H H H H H H H H H
charge: 0.127550 -0.252774 0.555808 -0.286499 -0.471226 -0.479375 -0.153596 -0.111789 0.007702 0.326579 -0.662708 -0.664333 -0.702377 -0.701467 -0.800889 -0.262494 -0.202303 -0.642161 -0.658088 0.244522 0.189712 0.215016 0.228782 0.220029 0.214966 0.230950 0.219637 0.272901 0.214054 0.208758 0.273069 0.215280 0.208456 0.313517 0.300100 0.224721 0.234674 0.229121 0.223683 0.245535 0.221583 0.214635 0.222820 0.237068 0.210854
chargesum: 0.00000
title: Mulliken charges with hydrogens summed into heavy atoms:
elementType: S S P O O O N C C C C C C C C C C C C
charge: 0.127550 -0.252774 0.555808 -0.286499 -0.471226 -0.479375 -0.153596 0.132733 0.197414 0.326579 0.001119 0.001221 -0.006663 -0.004663 -0.187272 0.196901 0.250501 0.039592 0.012654
polarizability: 2.89617037e+02 6.69694465e+00 1.99133307e+02 5.36099091e+00 9.81489915e+00 1.82099248e+02
1716.lowfreq: -8.3654 -6.4954 -0.0010 -0.0008 0.0023 4.1483 18.8944 19.3388 34.4799
frequency: 16.3166 18.2621 34.3406 39.8635 42.0313 48.4392 52.7487 69.3675 76.5020 87.1947 102.0783 116.3806 122.7395 138.2673 156.9673 159.3170 188.0788 202.9331 206.0518 215.0856 217.1134 228.0265 233.5087 236.7448 240.9115 271.7215 278.9225 286.8586 299.3179 328.9975 337.4126 362.5502 397.3666 422.1525 459.8169 464.1997 479.2029 502.0724 545.4585 583.0008 586.3222 617.8669 682.5057 690.7438 749.1984 796.0562 809.0370 853.1084 854.6806 867.8101 880.1715 911.5743 918.8228 922.0148 939.2017 939.9905 946.9236 1016.1974 1022.2587 1029.4151 1090.8446 1103.7028 1124.2540 1130.4956 1133.0922 1139.3978 1147.5924 1154.0058 1154.1094 1168.4596 1203.8885 1241.2978 1250.8337 1271.6157 1309.5538 1314.8576 1317.0892 1351.9533 1354.5873 1365.0118 1370.8164 1381.2633 1385.2944 1392.8517 1393.8603 1397.4536 1420.8824 1435.2714 1454.7576 1457.5049 1457.8683 1461.4184 1463.7546 1468.2595 1468.5815 1476.3854 1476.9130 1477.2736 1484.5619 1485.6073 1487.1234 1499.8789 1553.4346 2984.2337 2987.1533 2987.4142 2987.9209 2988.1391 2989.5826 2993.9380 2996.1373 3013.2161 3026.5713 3046.7156 3052.0863 3071.7212 3076.1572 3079.4155 3081.4064 3083.5892 3088.0966 3089.4363 3089.5171 3093.8190 3103.8782 3104.2768 3107.5925 3111.7442 3116.7902
redmass: 3.7442 3.4846 2.8047 3.4364 3.8340 2.1256 3.3340 3.5716 3.7395 3.1779 5.3856 7.6451 6.1517 2.7067 2.3449 2.4703 5.6507 1.3464 1.7146 1.2104 1.6195 1.5033 1.2183 1.3656 1.8554 3.9360 3.2225 3.0744 6.6843 2.8401 2.7600 4.4649 2.9457 4.6265 4.2196 3.9105 3.3601 3.1618 12.4549 3.3443 2.7703 9.2103 7.0599 4.3533 6.3670 1.1192 1.0886 3.4956 2.4696 3.7738 2.6842 1.2676 1.6715 1.2298 2.4563 1.3928 1.4330 2.8831 2.7194 1.9599 2.1485 2.2248 1.8304 1.4121 1.8731 1.5546 1.6931 2.1179 1.7199 1.9730 2.7029 1.3941 1.1529 1.1101 1.3527 1.3636 2.0955 1.2206 1.2439 1.2347 1.2074 1.2037 1.2354 1.2448 1.2259 1.2245 2.0176 1.1341 1.0438 1.0568 1.0408 1.0578 1.0461 1.0586 1.0627 1.0540 1.0481 1.0531 1.0504 1.0594 1.0799 1.0700 5.3402 1.0352 1.0361 1.0359 1.0377 1.0512 1.0377 1.0394 1.0620 1.0826 1.0576 1.0847 1.1081 1.1021 1.0999 1.0996 1.0992 1.0975 1.1008 1.0983 1.0983 1.0993 1.1059 1.1033 1.1021 1.0997 1.0991
irintensity: 0.2688 0.0425 0.4397 0.0509 0.6519 1.3747 1.7074 1.2080 1.8684 0.2858 2.2640 5.1490 1.2525 4.6850 3.6984 1.6713 7.2907 0.9837 1.9266 0.6603 2.0490 12.0332 0.4797 2.1877 12.5196 15.3600 1.1467 2.0125 45.5618 0.2304 13.4493 1.8438 2.9152 0.4037 10.2819 14.8945 3.6364 3.8410 100.6808 7.7031 22.1882 115.0196 116.9713 9.0281 16.9892 2.4767 3.1109 119.2116 1.6531 108.3010 3.0663 7.3200 1.3468 3.7938 1.1115 0.2517 0.0277 143.5794 101.5488 27.8200 9.6131 14.9119 4.4161 5.6839 40.7236 5.8135 9.0611 26.9081 12.5146 19.2176 30.1681 37.4851 0.6572 0.4478 5.9754 3.5619 175.3559 14.6420 5.4275 21.9473 22.9769 33.6555 46.1676 25.0443 28.2203 5.9054 44.2963 22.5482 0.4304 10.7709 10.3298 12.9276 1.1291 15.2300 24.2359 8.6097 13.6755 7.9421 1.3327 9.2730 6.4883 12.0277 322.7531 13.3760 38.6188 19.5283 14.5331 28.0378 31.5218 26.9529 39.7053 33.3244 25.3456 1.1306 11.6196 2.4183 14.2255 0.9367 76.3441 36.4341 19.2073 67.9352 13.8451 54.8316 4.7571 21.9888 34.2584 1.5785 22.9218
temp: 298.150 k
press: 1.00000 atm
elementType: 16 16 15 8 8 8 7 6 6 6 6 6 6 6 6 6 6 6 6 1 1 1 1 1 1 1 1 1 1 1 1 1 1 1 1 1 1 1 1 1 1 1 1 1 1
symmnumber: 1
zpe: 976932.9 jmol-1
zpe.correction: 0.372094 hartree
zpe.thermalcorrener: 0.398877 hartree
zpe.thermalcorrenthalpy: 0.399821 hartree
zpe.thermalcorrgfe: 0.311732 hartree
zpe.sumelectzpe: -1889.091373 hartree
zpe.sumelectthermal: -1889.064591 hartree
zpe.sumelectthermalent: -1889.063647 hartree
zpe.sumelectthermalfe: -1889.151736 hartree
dipole: 3.4739 3.9662 5.8012
dipole: 7.8392
quadrupole: -133.4114 -134.8302 -143.2204
quadrupole: -0.2920 -3.8681 -6.6393
quadrupole: 3.7425 2.3238 -6.0664 -0.2920 -3.8681 -6.6393
hfenergy: -1889.4634675 hartree
pointgroup: C01 [X(C12H26N1O3P1S2)]
dipole: -1.0777402 -0.4473579 2.8549291 debye
polarizability: 286.7592164|-1.94886|188.9827111|-18.7597642|-12.4159893|195.107664 unknown
InChI: InChI=1S/C8H16NOS.C4H10O2PS/c1-6(2)9(7(3)4)8(10)5-11;1-3-5-7(8)6-4-2/h6-7H,5H2,1-4H3;3-4H2,1-2H3
charge 0 multiplicity 1
45 atoms
S  0.782879 0.392342 -1.911056
S  4.512836 0.227396 -1.998866
P  2.77953 -0.054924 -0.90365
O  -1.939124 0.749979 -1.91971
O  2.735586 0.778174 0.648235
O  2.43076 -1.647193 -0.288081
N  -2.685619 0.092253 0.196618
C  -2.398301 -0.452217 1.56145
C  -4.115235 0.424665 -0.138401
C  -1.699532 0.29144 -0.750416
C  -2.734522 0.578748 2.666154
C  -3.106873 -1.808411 1.794394
C  -4.303375 1.933587 -0.421958
C  -4.657669 -0.462288 -1.283705
C  -0.255152 -0.062475 -0.376766
C  3.510051 2.041302 0.802818
C  3.534308 -2.368304 0.414867
C  2.788245 3.243584 0.187696
C  2.979262 -3.742622 0.777131
H  -1.31242 -0.639683 1.607943
H  -4.687373 0.181278 0.776605
H  -3.816143 0.801695 2.703698
H  -2.192508 1.526121 2.498458
H  -2.441228 0.179789 3.654001
H  -4.20668 -1.703195 1.787833
H  -2.825149 -2.539308 1.016231
H  -2.816375 -2.218318 2.778616
H  -3.753389 2.228153 -1.329568
H  -3.94314 2.543631 0.425993
H  -5.377024 2.150127 -0.572877
H  -4.112416 -0.260173 -2.219011
H  -4.555815 -1.534572 -1.037432
H  -5.729581 -0.24454 -1.44473
H  -0.109211 -1.137053 -0.182898
H  0.134724 0.517873 0.475981
H  3.606587 2.139507 1.897438
H  4.514055 1.902484 0.356371
H  4.401757 -2.440426 -0.268761
H  3.823662 -1.788449 1.3117
H  2.730894 3.160811 -0.911424
H  1.762434 3.33477 0.585255
H  3.338406 4.171733 0.432363
H  2.107775 -3.650051 1.447831
H  2.669266 -4.288129 -0.130093
H  3.75664 -4.334711 1.294921
