program: Gaussian 09
title: 000216767
version: EM64L-G09RevD.01
frameworkgroup: C1[X(C10H17NO2)]
method: RPBEPBE
basis: SDD
operation: Freq
keyword: #p
keyword: freq=noraman
keyword: PBEPBE/SDD
title: #p freq=noraman PBEPBE/SDD
converged: YES YES NO NO
title: Mulliken charges:
elementType: O O N C C C C C C C C C C H H H H H H H H H H H H H H H H H
charge: -0.255054 -0.247552 -0.054845 -0.145735 -0.453096 -0.444099 -0.389556 -0.371325 0.203912 -0.620307 -0.370176 -0.028121 -0.553463 0.262957 0.217226 0.230196 0.208167 0.220528 0.210563 0.200356 0.213265 0.175984 0.190177 0.223687 0.224504 0.222327 0.238020 0.251366 0.221749 0.218346
chargesum: 0.00000
title: Mulliken charges with hydrogens summed into heavy atoms:
elementType: O O N C C C C C C C C C C
charge: -0.255054 -0.247552 -0.054845 0.117221 -0.005674 -0.015404 0.021363 0.017923 0.203912 0.018061 0.090170 0.223245 -0.113367
polarizability: 1.62654232e+02 -8.63639537e+00 1.06655207e+02 7.92334322e+00 -1.57441295e-01 9.61409578e+01
1716.lowfreq: -27.2895 -8.1091 -0.0001 0.0007 0.0009 1.5197 11.3266 37.3075 57.5664
frequency: 4.0102 36.9663 57.4810 81.8739 106.7181 141.3987 164.7916 212.1442 241.2608 259.1709 261.0909 301.7600 347.8020 357.8316 376.0367 413.5408 431.1407 495.0129 529.3244 646.3836 688.3361 705.9444 767.4810 818.6882 854.6726 864.4095 904.3164 926.3833 938.2513 956.9304 961.2157 971.1904 992.2610 1016.7940 1032.1456 1062.0847 1089.7542 1101.7385 1104.9431 1124.8062 1142.4554 1158.3262 1170.0393 1195.3576 1248.6707 1252.1865 1266.7864 1280.3053 1282.5349 1305.7890 1315.4741 1325.2569 1342.1096 1347.0043 1359.4304 1373.8917 1428.4230 1431.2191 1449.2195 1455.6369 1460.3560 1463.2122 1468.3678 1480.5457 1483.0543 1628.7453 1660.3925 2821.8858 2855.5571 2869.0708 2981.9085 2991.5608 3017.6444 3018.3509 3021.7719 3027.6776 3039.3293 3050.7835 3062.5496 3075.8814 3090.5890 3107.2120 3128.4451 3200.5616
redmass: 4.4344 3.8350 4.7187 2.4963 2.9573 2.4422 3.4608 1.4667 1.7613 2.8549 3.0118 4.1970 2.4653 2.4515 2.1299 3.1369 2.4387 2.4485 1.9868 2.0749 4.4086 6.0735 2.6988 3.0891 3.4013 1.3956 2.4729 1.6628 2.2815 1.8455 1.3692 1.9808 2.4885 1.2214 1.7702 2.1052 1.8712 2.3168 2.6628 1.7417 1.1815 2.0521 2.3721 1.7673 1.1562 1.8360 1.2607 1.5611 1.2433 1.3547 1.3361 1.3101 1.2960 1.4131 1.4633 1.4415 1.1550 1.1687 1.1402 1.0883 1.0616 1.0705 1.0912 1.0977 1.0580 9.3312 4.5986 1.0707 1.0606 1.0652 1.0599 1.0622 1.0730 1.0607 1.0869 1.0882 1.0923 1.0978 1.1000 1.1009 1.0609 1.1017 1.0970 1.1143
irintensity: 1.2623 0.4888 0.1306 1.2734 2.4555 2.6637 1.5147 0.8742 2.1633 4.9080 0.5767 11.1155 1.6133 7.4345 6.7415 0.3227 4.3405 0.1504 0.6598 15.7408 8.4068 2.3788 3.1115 1.7138 32.3047 7.6109 8.8828 5.3433 76.1798 6.7047 62.6157 13.1403 53.0587 18.2207 14.0219 58.5331 20.2108 149.0569 128.9425 35.9654 9.4382 3.3584 8.8659 17.8589 6.1808 13.5045 6.6514 8.9857 2.8709 70.5295 18.7979 1.6893 3.8394 6.9172 15.4372 17.2544 11.1586 2.5797 24.1485 10.4054 27.8074 4.5006 3.4143 12.6835 9.8684 149.2425 3.8575 81.4157 78.7070 149.9183 20.1995 29.8194 42.2859 26.6777 49.8056 41.8283 23.8038 10.2425 63.7639 36.3965 8.3754 6.5004 7.2226 22.2615
temp: 298.150 k
press: 1.00000 atm
elementType: 8 8 7 6 6 6 6 6 6 6 6 6 6 1 1 1 1 1 1 1 1 1 1 1 1 1 1 1 1 1
symmnumber: 1
zpe: 672801.7 jmol-1
zpe.correction: 0.256257 hartree
zpe.thermalcorrener: 0.270361 hartree
zpe.thermalcorrenthalpy: 0.271305 hartree
zpe.thermalcorrgfe: 0.212321 hartree
zpe.sumelectzpe: -595.393544 hartree
zpe.sumelectthermal: -595.379440 hartree
zpe.sumelectthermalent: -595.378496 hartree
zpe.sumelectthermalfe: -595.437480 hartree
dipole: 0.0683 0.6785 -0.6088
dipole: 0.9142
quadrupole: -67.1455 -76.4179 -84.4942
quadrupole: -0.6352 4.4672 3.9666
quadrupole: 8.8737 -0.3987 -8.4750 -0.6352 4.4672 3.9666
hfenergy: -595.649801 hartree
pointgroup: C01 [X(C10H17N1O2)]
dipole: -0.0346664 -0.0253268 0.3570928 debye
polarizability: 161.2917616|6.2571484|100.6917541|12.7452908|6.6012589|103.4668812 unknown
InChI: InChI=1S/C10H17NO2/c1-3-7-13-10(12)9-5-4-6-11(2)8-9/h3,9H,1,4-8H2,2H3
charge 0 multiplicity 1
30 atoms
O  1.882529 -0.861099 0.11432
O  1.015976 0.395791 -1.651917
N  -2.878721 -1.082584 -0.230045
C  -0.491498 -0.471524 0.107979
C  -0.92928 0.833379 0.838262
C  -1.581057 -0.888021 -0.913331
C  -2.316793 0.630294 1.483767
C  -3.34454 0.155835 0.437917
C  0.836811 -0.252226 -0.592284
C  -3.898742 -1.657147 -1.127807
C  3.263086 -0.679899 -0.46048
C  3.869558 0.624164 -0.011762
C  4.968338 0.710308 0.778064
H  -0.372206 -1.275565 0.855086
H  -0.972585 1.658053 0.098975
H  -0.179862 1.109443 1.603104
H  -1.635073 -0.107882 -1.714812
H  -1.297038 -1.841347 -1.397444
H  -2.247462 -0.128765 2.286105
H  -2.66445 1.575569 1.942386
H  -4.31346 -0.057464 0.927003
H  -3.52063 0.978365 -0.306932
H  -4.162356 -0.988768 -1.986821
H  -4.823138 -1.860127 -0.557634
H  -3.535172 -2.615043 -1.541302
H  3.822465 -1.54888 -0.081078
H  3.174513 -0.718319 -1.561884
H  3.375724 1.53232 -0.38208
H  5.395234 1.67797 1.063721
H  5.476928 -0.184937 1.157924
