program: Gaussian 09
title: 000216800
version: EM64L-G09RevD.01
frameworkgroup: C1[X(C14H17N3O4)]
method: RPBEPBE
basis: SDD
operation: Freq
keyword: #p
keyword: freq=noraman
keyword: PBEPBE/SDD
title: #p freq=noraman PBEPBE/SDD
converged: YES YES NO NO
title: Mulliken charges:
elementType: O O O O N N N C C C C C C C C C C C C C C H H H H H H H H H H H H H H H H H
charge: -0.293920 -0.192138 -0.283690 -0.234010 -0.015473 0.031218 -0.139871 -0.584663 -0.368362 0.551958 -0.529568 -0.417443 0.223980 0.224565 -0.329676 -0.314561 0.233033 -0.518817 -0.537483 0.112618 -0.752680 0.234007 0.236650 0.263594 0.245798 0.253528 0.233936 0.246145 0.304123 0.214543 0.259924 0.228638 0.226314 0.243884 0.232474 0.238186 0.234808 0.238433
chargesum: 0.00000
title: Mulliken charges with hydrogens summed into heavy atoms:
elementType: O O O O N N N C C C C C C C C C C C C C C
charge: -0.293920 -0.192138 -0.283690 -0.234010 -0.015473 0.031218 -0.139871 -0.114006 0.141031 0.551958 -0.276040 -0.183508 0.223980 0.224565 -0.083532 -0.010438 0.233033 0.184287 0.165189 0.112618 -0.041253
polarizability: 2.45860807e+02 -1.87941003e+01 2.15435277e+02 3.65567033e+01 4.14839967e+00 1.35943804e+02
1716.lowfreq: -7.7239 -2.2759 -0.0008 -0.0006 -0.0006 3.4855 12.8789 16.6289 22.1657
frequency: 12.6692 16.1315 22.1262 40.3274 48.5535 58.9395 68.9519 81.1211 88.7930 115.7522 119.4765 128.3967 165.5396 197.0862 207.4212 238.1558 257.8317 276.3013 301.0480 315.9265 337.5758 353.9265 369.5787 422.0826 434.2461 460.5639 473.6901 488.9120 531.9110 558.6138 579.3500 591.5856 609.7061 632.8890 644.2210 666.6599 689.3182 708.8926 715.0919 732.9005 741.0855 805.4522 832.5899 859.6666 882.2649 894.7502 922.3686 935.2281 946.5737 981.4345 984.7732 996.2230 1012.1736 1029.9347 1034.0488 1111.2531 1111.5561 1112.9318 1118.3080 1126.7405 1145.8119 1153.4792 1160.8622 1176.6116 1212.4896 1215.3089 1257.1896 1274.2484 1276.7834 1313.7812 1348.0744 1369.9679 1376.8657 1382.3616 1406.6171 1432.8421 1440.6088 1442.6542 1445.6521 1454.0846 1454.8232 1464.2279 1467.2458 1474.3513 1478.7203 1480.2646 1499.7134 1566.5874 1581.1447 1617.7743 1699.0635 2966.7026 2978.9293 2994.9132 2997.1287 3028.8875 3055.2564 3058.2873 3081.1722 3088.5179 3105.2337 3127.2415 3129.5782 3131.3378 3131.5420 3139.2942 3167.6065 3275.4011
redmass: 5.9658 4.7870 3.8773 6.4053 2.1741 4.3614 4.1799 1.1063 4.5084 4.1182 3.3734 2.3368 2.7245 3.1367 4.3265 1.3605 2.7922 4.1199 3.4275 3.7461 3.5699 3.1850 3.9318 4.0926 5.2660 4.1724 4.2070 3.7534 4.2837 5.2943 4.1460 4.7517 5.1700 3.3734 3.6602 2.7327 4.4814 2.2418 4.6461 3.2563 6.6497 1.4414 8.0912 4.1296 1.9335 3.3410 2.0381 1.6189 2.6411 7.5345 2.0113 3.4476 3.3225 2.1877 1.8108 1.2401 1.2979 2.2585 2.5638 3.4597 1.4789 1.3346 1.3433 1.5379 1.7822 1.4060 2.8000 1.7693 3.2834 1.5833 1.3927 1.4502 1.8136 5.8265 2.1187 1.2347 1.8948 1.4043 1.1052 1.0515 1.0807 1.1068 1.0502 1.1070 1.6509 1.0591 2.6330 7.1169 7.2444 6.6680 11.3751 1.0324 1.0344 1.0365 1.0602 1.0616 1.1014 1.1044 1.0970 1.0974 1.1044 1.0998 1.1048 1.0902 1.1005 1.0915 1.0939 1.0992
irintensity: 1.7671 4.8823 2.3861 2.6013 2.7452 1.8083 0.8576 0.1538 4.5243 3.5451 7.9128 0.4028 4.1775 1.1911 0.7584 1.4000 4.1335 1.9896 0.3106 4.0365 6.2848 0.6154 1.2227 15.8530 13.6741 6.7405 3.1631 1.4887 32.1819 0.1937 70.8843 4.0503 5.3418 15.7859 17.9560 11.7661 4.6228 64.0324 2.9036 2.9561 27.3918 45.5249 7.0672 2.6315 20.9053 26.7293 14.2390 6.1870 16.8877 45.9216 44.0503 57.1569 35.6278 3.8009 5.4030 6.3729 7.9444 106.9481 6.2360 87.2189 3.7385 3.4597 15.5194 4.2382 79.1055 27.7750 205.8566 33.5362 199.0941 47.4841 25.9728 22.3044 178.2825 19.5186 13.3805 0.9128 18.4589 30.6625 37.3459 19.0983 12.7250 12.1408 14.1263 64.9779 10.5334 25.3807 117.3933 178.4446 26.7800 16.4681 995.0862 55.5904 76.9106 5.8657 25.1991 26.3455 17.9699 38.8828 14.6974 39.9180 7.7222 25.6366 18.7082 6.9379 18.9388 6.0654 6.6304 9.1153
temp: 298.150 k
press: 1.00000 atm
elementType: 8 8 8 8 7 7 7 6 6 6 6 6 6 6 6 6 6 6 6 6 6 1 1 1 1 1 1 1 1 1 1 1 1 1 1 1 1 1
symmnumber: 1
zpe: 769969.6 jmol-1
zpe.correction: 0.293266 hartree
zpe.thermalcorrener: 0.314978 hartree
zpe.thermalcorrenthalpy: 0.315922 hartree
zpe.thermalcorrgfe: 0.238001 hartree
zpe.sumelectzpe: -1007.152923 hartree
zpe.sumelectthermal: -1007.131211 hartree
zpe.sumelectthermalent: -1007.130267 hartree
zpe.sumelectthermalfe: -1007.208188 hartree
dipole: 2.1138 -3.8783 -2.3130
dipole: 4.9860
quadrupole: -132.2049 -103.1784 -122.6562
quadrupole: 19.5805 11.2874 -2.5426
quadrupole: -12.8584 16.1681 -3.3097 19.5805 11.2874 -2.5426
hfenergy: -1007.4461893 hartree
pointgroup: C01 [X(C14H17N3O4)]
dipole: 0.7085228 1.5243401 1.0111197 debye
polarizability: 248.0041298|21.0287663|216.776357|-29.4251328|6.8784996|132.459401 unknown
InChI: InChI=1S/C14H17N3O4/c1-10(18)15-14-9-17(16-21-14)7-6-11-4-5-12(19-2)13(8-11)20-3/h4-5,8-9H,6-7H2,1-3H3
charge 0 multiplicity 1
38 atoms
O  4.644692 0.678778 -0.25895
O  -2.180367 0.112754 -1.359442
O  3.816039 -1.965097 0.439414
O  -3.622289 -2.543093 -0.759971
N  -1.414901 1.845039 -0.239365
N  -1.155788 1.119867 -1.368512
N  -4.139938 -0.39527 0.087794
C  0.39019 2.596102 1.346876
C  -0.468938 2.93463 0.094632
C  1.282697 1.381807 1.147318
C  2.551487 1.517147 0.532355
C  0.846487 0.086895 1.510782
C  3.378668 0.403627 0.281338
C  2.930277 -0.900217 0.667694
C  1.659005 -1.042323 1.270697
C  -2.489992 1.426502 0.492221
C  -3.071605 0.302527 -0.162212
C  5.109383 -0.128103 -1.407947
C  3.37839 -3.307681 0.837514
C  -4.469828 -1.686479 -0.366996
C  -5.957598 -1.986457 -0.259475
H  -0.279231 2.45121 2.215277
H  0.997266 3.496958 1.556883
H  0.171296 3.06587 -0.792986
H  -1.054733 3.856529 0.256805
H  2.936974 2.498622 0.232602
H  -0.132816 -0.051474 1.983675
H  1.294669 -2.030958 1.563784
H  -2.81685 1.914008 1.402887
H  4.384438 -0.063342 -2.24211
H  5.256485 -1.180556 -1.119219
H  6.063344 0.334026 -1.704341
H  3.194761 -3.360208 1.927723
H  4.214105 -3.970515 0.569716
H  2.467033 -3.61262 0.288746
H  -6.164816 -3.000512 -0.632742
H  -6.539003 -1.245922 -0.83779
H  -6.282897 -1.901171 0.793027
