program: Gaussian 09
title: 000211558
version: EM64L-G09RevD.01
frameworkgroup: C1[X(C23H25N3O3)]
method: RPBEPBE
basis: SDD
operation: Freq
keyword: #p
keyword: freq=noraman
keyword: PBEPBE/SDD
title: #p freq=noraman PBEPBE/SDD
converged: YES YES NO NO
title: Mulliken charges:
elementType: O O O N N N C C C C C C C C C C C C C C C C C C C C C C C H H H H H H H H H H H H H H H H H H H H H H H H H
charge: -0.247677 -0.286184 -0.275100 -0.097664 -0.207112 -0.034523 -0.346821 -0.351003 -0.339534 -0.378734 -0.312083 -0.318712 0.126151 0.180768 0.017571 -0.356229 0.368102 0.346321 -0.525987 -0.386349 -0.376772 -0.371405 0.326918 -0.227270 -0.374941 -0.247571 -0.231338 -0.238724 -0.536601 0.221624 0.226418 0.193050 0.211672 0.220495 0.200234 0.250703 0.246398 0.191045 0.212840 0.215048 0.191791 0.242897 0.252456 0.288783 0.220567 0.268617 0.226007 0.244742 0.228260 0.228495 0.231283 0.222481 0.221190 0.245402
chargesum: 0.00000
title: Mulliken charges with hydrogens summed into heavy atoms:
elementType: O O O N N N C C C C C C C C C C C C C C C C C C C C C C C
charge: -0.247677 -0.286184 -0.275100 -0.097664 -0.207112 -0.034523 0.101222 0.053719 0.081195 0.118367 0.091802 0.088127 0.126151 0.180768 0.017571 -0.113332 0.368102 0.346321 -0.273530 -0.097566 -0.156204 -0.102789 0.326918 -0.001263 -0.130198 -0.019310 -0.002843 -0.007441 0.152472
polarizability: 3.72363852e+02 2.10334080e+01 3.96271872e+02 -3.47311363e+01 2.32996753e+01 1.69174825e+02
1716.lowfreq: -4.0116 -0.0382 -0.0315 -0.0005 3.4383 4.6025 9.6419 20.7054 24.7261
frequency: 9.4885 20.6934 24.6639 28.8751 36.5012 55.2769 57.6109 73.2241 81.2396 86.8637 112.5818 135.5078 143.4623 197.7591 198.9864 221.6647 227.7057 240.4778 242.4033 255.8125 264.9995 277.1308 311.3737 333.5348 338.4794 353.5006 378.8610 396.9996 401.4063 407.0482 431.5962 454.7921 460.2744 469.0580 489.4977 502.6022 546.7288 570.4298 585.0295 597.9925 614.7094 617.9451 632.9976 652.5399 664.3463 692.0973 697.6241 738.3046 755.9332 762.2883 766.2172 779.8337 790.3959 794.1416 811.6142 840.7505 850.5017 879.5966 885.6332 890.6328 893.8799 911.3536 916.6876 929.3742 972.7751 981.4290 983.8368 989.0234 996.3827 999.6078 1001.7916 1013.5975 1027.0086 1027.5208 1042.2463 1053.2089 1072.6966 1076.2101 1085.5101 1092.4298 1102.0232 1107.6924 1112.3393 1129.9656 1137.3581 1156.0216 1173.8098 1186.5565 1189.2578 1192.1172 1194.6109 1204.0706 1236.3062 1242.9039 1263.4628 1272.4681 1288.2638 1295.8757 1300.8885 1311.5177 1315.7551 1321.1164 1330.6177 1334.6671 1349.8153 1363.5965 1370.3911 1371.7426 1382.0049 1388.3692 1390.6242 1420.6162 1429.4638 1436.8007 1443.5447 1444.3509 1449.7229 1451.5513 1460.6890 1466.5897 1471.7312 1474.6741 1476.9743 1479.1799 1492.9021 1557.7369 1577.2999 1586.9058 1599.7535 1614.3534 1616.9872 2869.9977 2879.6538 2906.6079 2954.8219 2958.8958 2959.2290 3028.2658 3037.6905 3041.9576 3047.1292 3058.3776 3080.0658 3084.0330 3125.1248 3126.3389 3133.4331 3134.2598 3138.3677 3146.8312 3153.2222 3159.7104 3161.9978 3167.4693 3171.5710 3197.6470
redmass: 5.7835 5.5461 2.9630 3.6538 4.8777 5.2826 4.0161 6.4486 3.8785 4.0747 4.8384 4.3847 4.8422 2.5684 2.2910 3.8166 3.6467 4.7155 2.0207 3.0193 2.1860 4.4568 2.5314 4.2965 4.7128 3.3479 3.5208 2.6450 2.8774 3.9581 4.1484 5.7008 4.1778 2.7842 3.7088 4.9457 4.8450 3.7504 4.3939 6.3164 3.2052 4.6703 5.0960 4.6270 5.4038 2.0092 1.7589 5.3960 4.6424 4.4644 2.3356 2.0462 1.6105 2.3443 2.7988 1.6033 1.2648 2.0249 1.5610 2.5543 2.6044 2.2291 2.8181 1.4801 1.3790 1.4020 5.2147 5.7679 2.6154 2.2008 1.5406 5.0628 2.2966 2.2476 3.7201 1.9785 2.6989 2.5678 1.7278 2.4897 1.6881 2.4056 1.2605 2.5645 2.5138 1.3853 1.0560 1.4805 1.3547 1.2295 1.2338 1.9792 2.5157 1.9552 2.6402 1.2923 1.4459 1.3097 1.3792 1.3012 1.3795 1.6600 1.7852 1.2703 1.3061 1.4531 3.0749 1.2844 6.2169 1.4516 6.7561 2.3786 1.6443 1.2546 1.0834 1.7670 1.0815 1.0984 1.0979 1.0502 2.6349 1.2006 2.5183 1.1433 2.6400 6.2889 5.3628 6.3456 8.1421 6.1801 6.5126 1.0700 1.0698 1.0686 1.0663 1.0663 1.0332 1.0905 1.0912 1.0902 1.1040 1.0581 1.0965 1.0978 1.0993 1.0848 1.1069 1.0882 1.0880 1.0935 1.0913 1.0947 1.0918 1.0943 1.0994 1.0949
irintensity: 0.0111 0.1940 0.0917 0.0293 0.4534 0.7020 3.2857 0.1925 3.9782 1.5149 1.8108 2.7502 1.2470 3.5548 2.8327 1.7985 1.8713 0.5225 2.3501 5.5550 1.1153 0.6890 10.0691 2.8507 3.3864 11.3458 2.5017 5.0249 0.2450 6.8302 0.4837 0.4040 3.4163 0.7248 4.1146 20.9093 6.2640 3.7939 8.5198 19.6414 13.3660 9.6658 9.9309 9.9885 4.4333 21.3179 51.8335 4.2606 5.4510 20.5772 13.5555 63.2651 35.1350 6.7258 17.4696 0.1848 1.0822 26.9841 23.6253 16.1065 1.5997 14.0647 11.4923 4.7054 2.1411 0.8556 0.2108 0.6709 59.4978 5.1859 3.2439 86.4995 15.0616 7.2820 18.3042 14.3592 2.1214 16.1391 17.9074 23.3884 23.9672 2.0162 0.2938 37.1403 101.0841 4.4981 0.5326 40.4358 8.5579 11.3874 3.5024 86.9577 17.6849 69.2182 44.7156 5.2383 27.6516 3.1588 14.0438 25.5138 2.5433 27.4962 18.0999 4.4800 8.0455 4.1917 16.6737 5.9004 0.0639 5.4306 30.8469 16.4627 64.0288 19.4358 2.7725 18.7735 0.3396 15.5744 9.5195 13.1501 7.0454 33.2140 42.6661 13.6650 33.4545 248.5384 48.7753 12.0311 92.1165 6.1920 56.4107 61.7551 74.1562 67.7002 32.5556 118.5044 69.6465 27.2953 24.3284 31.0089 47.9143 20.6452 41.4177 36.4974 24.1704 4.6073 2.8629 5.0591 12.7733 27.9737 6.6787 9.6111 23.1131 17.9972 16.9231 8.7189
temp: 298.150 k
press: 1.00000 atm
elementType: 8 8 8 7 7 7 6 6 6 6 6 6 6 6 6 6 6 6 6 6 6 6 6 6 6 6 6 6 6 1 1 1 1 1 1 1 1 1 1 1 1 1 1 1 1 1 1 1 1 1 1 1 1 1
symmnumber: 1
zpe: 1147802.2 jmol-1
zpe.correction: 0.437175 hartree
zpe.thermalcorrener: 0.463201 hartree
zpe.thermalcorrenthalpy: 0.464145 hartree
zpe.thermalcorrgfe: 0.377048 hartree
zpe.sumelectzpe: -1279.220854 hartree
zpe.sumelectthermal: -1279.194827 hartree
zpe.sumelectthermalent: -1279.193883 hartree
zpe.sumelectthermalfe: -1279.280981 hartree
dipole: -4.2024 1.3260 0.2997
dipole: 4.4168
quadrupole: -157.5803 -153.7949 -171.9999
quadrupole: 22.5741 -7.3083 3.8008
quadrupole: 3.5447 7.3301 -10.8748 22.5741 -7.3083 3.8008
hfenergy: -1279.6580286 hartree
pointgroup: C01 [X(C23H25N3O3)]
dipole: -1.5388327 0.7723811 0.2345852 debye
polarizability: 375.0090581|26.6148666|387.4189014|-42.6201269|32.8292098|175.3825897 unknown
InChI: InChI=1S/C23H25N3O3/c1-28-20-9-5-8-19(16-20)21-17-22(18-6-3-2-4-7-18)24-26(23(21)27)11-10-25-12-14-29-15-13-25/h2-9,16-17H,10-15H2,1H3
charge 0 multiplicity 1
54 atoms
O  6.764567 -3.110485 0.158286
O  0.29132 -2.102698 -0.828109
O  -5.793258 -1.158416 1.529818
N  4.452481 -1.366439 -0.032153
N  1.025934 0.108471 -0.712442
N  0.90664 1.456221 -0.500007
C  3.146705 -0.757563 0.298113
C  5.499885 -1.142153 0.996771
C  4.353292 -2.814666 -0.357461
C  2.404461 -0.352127 -0.999869
C  6.847779 -1.676639 0.482753
C  5.7139 -3.330861 -0.851293
C  -0.009496 -0.880645 -0.628786
C  -1.343901 -0.331416 -0.31201
C  -0.326864 1.929171 -0.208282
C  -1.457014 1.046366 -0.127223
C  -2.523855 -1.229255 -0.201827
C  -0.433666 3.399993 -0.000094
C  -3.625974 -0.84512 0.605774
C  -2.596589 -2.463041 -0.91487
C  -1.562175 3.978281 0.642177
C  0.611215 4.259543 -0.439829
C  -4.781389 -1.653546 0.68964
C  -3.755755 -3.256928 -0.827848
C  -4.859449 -2.869969 -0.033238
C  -1.647018 5.374604 0.831755
C  0.525999 5.65259 -0.248048
C  -0.60535 6.219528 0.386601
C  -7.011134 -1.960675 1.666866
H  3.316023 0.151047 0.904984
H  2.498295 -1.444833 0.890937
H  5.250965 -1.652074 1.961176
H  5.586502 -0.056878 1.19378
H  3.590968 -2.968985 -1.14254
H  4.037785 -3.405606 0.538326
H  2.33057 -1.217885 -1.675441
H  2.935695 0.472902 -1.496362
H  7.149311 -1.104752 -0.421516
H  7.630767 -1.593961 1.254763
H  5.690705 -4.42048 -1.017735
H  5.987599 -2.812174 -1.795361
H  -2.447223 1.478275 0.040593
H  -3.601389 0.064032 1.214815
H  -1.743656 -2.78993 -1.511329
H  -2.373346 3.345702 1.01853
H  1.481797 3.815406 -0.931185
H  -3.803651 -4.199532 -1.384142
H  -5.744157 -3.510703 0.023371
H  -2.523509 5.800695 1.332254
H  1.338678 6.29904 -0.597653
H  -0.672855 7.30319 0.532627
H  -6.791356 -2.958127 2.095068
H  -7.52733 -2.079837 0.694205
H  -7.651276 -1.393766 2.358571
