program: Gaussian 09
title: 000216845
version: EM64L-G09RevD.01
frameworkgroup: C1[X(C11H25N2O8PS2)]
method: RPBEPBE
basis: SDD
operation: Freq
keyword: #p
keyword: freq=noraman
keyword: PBEPBE/SDD
title: #p freq=noraman PBEPBE/SDD
converged: YES YES NO NO
title: Mulliken charges:
elementType: S S P O O O O O O O O N N C C C C C C C C C C C H H H H H H H H H H H H H H H H H H H H H H H H H
charge: 1.069837 1.072283 1.369715 -0.525838 -0.652107 -0.420123 -0.396996 -0.502319 -0.540064 -0.583250 -0.491094 -0.468572 -0.812093 -0.312682 -0.396225 -0.343459 -0.368875 -0.280060 -0.378446 -0.390491 -0.262858 -0.316627 -0.766647 -0.764075 0.257319 0.229253 0.241531 0.230793 0.424435 0.240454 0.209693 0.211819 0.234674 0.206376 0.261238 0.227469 0.205032 0.232655 0.253913 0.240743 0.223260 0.243077 0.242632 0.349653 0.286679 0.278001 0.279731 0.282284 0.368354
chargesum: 0.00000
title: Mulliken charges with hydrogens summed into heavy atoms:
elementType: S S P O O O O O O O O N N C C C C C C C C C C C
charge: 1.069837 1.072283 1.369715 -0.525838 -0.652107 -0.420123 -0.396996 -0.502319 -0.540064 -0.583250 -0.491094 -0.468572 -0.387659 0.173889 0.076100 0.106688 0.077619 0.187554 0.054055 0.096077 0.201145 0.169082 0.147687 0.166293
polarizability: 2.84836104e+02 -2.59842952e+00 2.17602980e+02 5.14586314e+00 5.28086314e+00 2.09673334e+02
1716.lowfreq: -8.3704 -0.0009 0.0013 0.0014 3.8228 4.9360 21.5306 38.4485 45.3843
frequency: 21.2577 37.9716 45.0019 49.5534 60.8276 62.8844 71.0485 79.4783 89.8867 95.7232 100.7647 108.9384 113.7214 132.6043 154.9748 177.8689 184.8940 195.8131 200.0747 206.6100 233.9488 236.4659 240.9696 254.4302 259.3763 267.0224 270.1604 274.4995 284.9984 301.8043 310.5949 321.8489 341.9748 345.1754 352.0394 368.5697 388.0794 401.1898 415.9320 425.3653 426.6935 433.4939 482.3401 526.0800 540.2749 554.7433 583.6615 585.0420 592.9787 645.4722 703.2451 753.6010 768.3078 801.2729 815.1061 822.0912 832.0202 848.7831 874.1722 876.5142 885.9560 905.2500 908.6770 927.8814 931.7961 940.5160 950.7637 985.8054 1002.6906 1004.5761 1009.2804 1013.0672 1032.5918 1041.1566 1062.3276 1070.4075 1074.7135 1090.0139 1104.0455 1106.8633 1122.5182 1126.3376 1193.9111 1196.9748 1203.1373 1222.8056 1232.3454 1262.5244 1271.6201 1271.9289 1299.6443 1319.6547 1336.4883 1339.8851 1343.7534 1344.5248 1347.8432 1350.4160 1351.6150 1357.3984 1364.0991 1369.6596 1419.7798 1420.6303 1435.7731 1439.7979 1443.8615 1445.1137 1449.4709 1452.6333 1458.3841 1462.2758 1472.8764 1475.5225 1478.1965 1484.4386 2938.3552 2950.5691 2969.0330 2969.3373 2989.7385 2993.9756 2998.0106 2999.9009 3000.1693 3001.9584 3007.9575 3038.9201 3048.0290 3058.0739 3059.9793 3062.3580 3068.9885 3069.6789 3072.8816 3112.5936 3119.5575 3148.6764 3180.5106 3181.9392 3332.2301
redmass: 7.0634 4.4578 5.0105 6.4702 6.8064 4.9095 5.3502 5.7128 5.0405 3.6743 4.4000 5.9182 6.0093 4.5106 3.4762 3.4822 3.0275 3.2853 5.5392 3.9339 4.0220 3.7747 3.2453 3.3897 2.0666 1.8746 2.2007 1.8510 3.8791 2.9769 2.9011 2.3352 6.6720 5.5915 5.0869 5.4777 4.2722 3.5021 6.3096 3.8555 4.1559 4.4615 4.6572 3.8955 2.6591 3.2037 7.5041 6.9963 6.2907 3.5821 1.3835 1.7482 2.1156 2.5108 4.0991 6.5356 10.5588 2.5025 1.8424 2.2577 2.9517 3.1149 3.2980 3.7367 4.5189 2.5115 2.4923 2.2685 1.6753 1.4574 1.8912 8.2324 2.2190 2.3262 1.6645 1.6074 1.8897 2.3252 2.2024 2.8949 2.9319 3.1785 1.1162 1.1839 1.1217 1.2558 1.3623 1.1455 1.1039 1.1503 1.2451 1.2306 1.1307 1.2316 1.2993 1.3084 1.1324 1.3375 1.2414 1.2632 1.2569 1.2720 1.0414 1.0422 1.0941 1.0865 1.0561 1.0581 1.1434 1.0793 1.0818 1.0844 1.0811 1.0828 1.0802 1.0752 1.0415 1.0691 1.0664 1.0605 1.0596 1.0656 1.0600 1.0370 1.0566 1.0561 1.0613 1.1006 1.1002 1.0949 1.1010 1.0981 1.1065 1.1013 1.1034 1.0994 1.0932 1.1063 1.1073 1.1070 1.0813
irintensity: 2.3245 0.3685 0.7116 1.4127 0.7889 4.2548 3.2374 8.8001 4.9386 3.7635 15.3968 8.0803 0.9327 4.0908 17.3951 8.8156 1.0929 5.5208 0.4761 0.9982 8.8244 4.5178 0.5138 1.5236 5.7486 3.4732 5.1499 0.7726 6.4595 19.3588 6.4440 11.3930 25.8039 16.7838 19.3398 6.9318 28.8812 13.0434 7.7866 9.9003 3.8809 22.9399 63.8295 31.6696 22.5099 16.1853 15.0422 32.3305 31.8098 57.7369 201.8043 14.2952 18.3094 51.4919 6.4834 67.8603 83.0682 70.0792 49.1282 34.9386 25.1845 68.4919 43.9313 70.5238 76.5222 28.5178 47.1134 6.5700 33.2894 18.5842 5.1147 102.0589 16.7357 69.3440 77.5188 65.4644 17.3622 9.1287 25.6274 56.3904 61.7413 48.1686 0.7523 5.5948 2.7212 9.9030 14.6925 12.2209 5.0971 1.4578 1.5725 8.4452 6.6911 5.1932 12.2279 4.4200 12.4675 9.6949 6.2381 5.5716 8.7357 8.6117 3.1301 3.4381 28.4266 11.0753 6.0827 20.9844 33.6358 15.3851 13.4700 1.4944 2.9485 44.1622 6.4521 21.1304 192.2834 50.7409 32.0219 15.7573 17.3033 24.0262 29.1013 46.3566 20.8085 40.5858 34.9432 4.1225 16.2622 18.1131 27.3264 2.2380 40.3957 25.4369 48.3998 9.3846 43.2757 33.1406 0.3732 0.9310 600.3102
temp: 298.150 k
press: 1.00000 atm
elementType: 16 16 15 8 8 8 8 8 8 8 8 7 7 6 6 6 6 6 6 6 6 6 6 6 1 1 1 1 1 1 1 1 1 1 1 1 1 1 1 1 1 1 1 1 1 1 1 1 1
symmnumber: 1
zpe: 998522.2 jmol-1
zpe.correction: 0.380317 hartree
zpe.thermalcorrener: 0.409658 hartree
zpe.thermalcorrenthalpy: 0.410602 hartree
zpe.thermalcorrgfe: 0.320161 hartree
zpe.sumelectzpe: -2280.484016 hartree
zpe.sumelectthermal: -2280.454674 hartree
zpe.sumelectthermalent: -2280.453730 hartree
zpe.sumelectthermalfe: -2280.544171 hartree
dipole: 0.6708 -0.3773 -1.9302
dipole: 2.0779
quadrupole: -241.7119 -156.3410 -151.4368
quadrupole: -6.4244 0.8879 5.2254
quadrupole: -58.5486 26.8223 31.7264 -6.4244 0.8879 5.2254
hfenergy: -2280.8643326 hartree
pointgroup: C01 [X(C11H25N2O8P1S2)]
dipole: 0.2986383 0.1333891 0.749244 debye
polarizability: 280.9372172|-16.0963833|222.5040826|-2.4466692|5.4875652|208.6711189 unknown
InChI: InChI=1S/C11H25N2O8PS2/c1-23(15,16)20-10-4-7-13(8-5-11-21-24(2,17)18)22(14)12-6-3-9-19-22/h12H,3-11H2,1-2H3
charge 0 multiplicity 1
49 atoms
S  -4.769313 1.04116 -1.037437
S  4.399788 -1.739574 -0.894657
P  0.074726 -0.669534 -0.303649
O  -1.630017 -1.054025 -0.400413
O  0.755385 -0.719431 -1.752715
O  -3.357324 2.275966 -0.859801
O  4.463613 0.075845 -0.352282
O  -6.05479 1.825426 -1.615264
O  -4.889707 0.179432 0.336529
O  3.3733 -2.52629 0.103956
O  5.914077 -2.266945 -1.030566
N  0.055358 0.921913 0.470571
N  0.710177 -1.787369 0.822032
C  -0.450737 2.029355 -0.398771
C  1.243892 1.282267 1.298921
C  -0.090571 -2.358588 1.929805
C  -1.516255 -2.73381 1.46637
C  -2.259684 -1.522726 0.881777
C  -1.409818 2.989042 0.337754
C  2.576565 1.439458 0.486602
C  -2.825501 2.417389 0.51626
C  3.644777 0.381378 0.845918
C  -3.959731 -0.009695 -2.395345
C  3.597746 -1.513881 -2.599337
H  -0.984823 1.597107 -1.263173
H  0.404546 2.60098 -0.813634
H  1.3575 0.512284 2.083163
H  0.987263 2.225635 1.81309
H  1.62916 -2.200116 0.588781
H  0.444324 -3.252715 2.294667
H  -0.157441 -1.644425 2.778082
H  -2.095717 -3.114215 2.330059
H  -1.465671 -3.53672 0.708223
H  -2.269836 -0.67764 1.598374
H  -3.298103 -1.751271 0.601189
H  -1.479441 3.93365 -0.234507
H  -1.015174 3.245519 1.340982
H  3.00181 2.451117 0.614346
H  2.345531 1.326099 -0.589571
H  -2.798107 1.433537 1.020401
H  -3.466007 3.10865 1.094622
H  4.349149 0.731399 1.622437
H  3.169514 -0.553056 1.21004
H  -3.071504 -0.460729 -1.923711
H  -3.710454 0.692006 -3.202508
H  -4.717926 -0.745974 -2.698372
H  3.653409 -2.500474 -3.081782
H  4.214167 -0.759203 -3.10675
H  2.560976 -1.181209 -2.396907
