program: Gaussian 09
title: 000216824
version: EM64L-G09RevD.01
frameworkgroup: C1[X(C14H30NO3PS2)]
method: RPBEPBE
basis: SDD
operation: Freq
keyword: #p
keyword: freq=noraman
keyword: PBEPBE/SDD
title: #p freq=noraman PBEPBE/SDD
converged: YES YES NO NO
title: Mulliken charges:
elementType: S S P O O O N C C C C C C C C C C C C C C H H H H H H H H H H H H H H H H H H H H H H H H H H H H H H
charge: 0.125914 -0.235832 0.557078 -0.266213 -0.465561 -0.485475 -0.101749 -0.385558 -0.433382 -0.339477 -0.324069 -0.339491 -0.328589 0.325804 -0.834141 -0.696184 -0.701697 -0.210789 -0.215684 -0.655672 -0.647220 0.199701 0.255423 0.219477 0.215744 0.178542 0.233207 0.183369 0.244697 0.187511 0.206207 0.192901 0.188702 0.291021 0.310621 0.207637 0.217064 0.217634 0.210794 0.216891 0.218935 0.219651 0.235961 0.218221 0.238896 0.232403 0.242190 0.208646 0.219479 0.230641 0.215822
chargesum: 0.00000
title: Mulliken charges with hydrogens summed into heavy atoms:
elementType: S S P O O O N C C C C C C C C C C C C C C
charge: 0.125914 -0.235832 0.557078 -0.266213 -0.465561 -0.485475 -0.101749 0.069566 0.001838 0.072272 0.103996 0.054227 0.053015 0.325804 -0.232499 -0.053849 -0.055077 0.244823 0.241433 0.027566 0.018722
polarizability: 2.91080956e+02 -7.44934030e+00 2.25114320e+02 7.98460517e+00 5.97916117e-01 2.01547153e+02
1716.lowfreq: -8.9189 -5.7186 -0.0018 -0.0005 0.0006 3.9315 10.0257 16.1808 26.2242
frequency: 6.9813 14.7870 26.0300 31.8010 36.3518 37.7854 45.1905 49.6687 53.4558 57.2282 63.9502 73.6846 78.2429 90.5057 107.6552 114.7868 119.8408 130.4882 157.6146 166.8866 203.4338 213.3486 222.1850 227.3435 233.7362 236.2660 244.8894 250.1648 263.7103 280.1438 286.2929 303.9356 324.9730 332.0133 390.1300 396.9494 407.1627 435.5356 453.4484 531.7276 537.7071 552.1301 637.6549 649.3829 689.3815 718.5316 734.7431 736.2635 780.9717 788.6745 798.0428 808.5480 809.2939 859.1916 871.2228 888.4288 897.3585 900.7751 919.6689 923.7890 981.1467 1010.7332 1012.6757 1023.2253 1029.7956 1070.6298 1073.2428 1097.3873 1101.5089 1104.8543 1110.7117 1113.7401 1129.0345 1136.0073 1143.7435 1174.1105 1197.5269 1211.2245 1242.9510 1250.7208 1253.0246 1260.5722 1267.2822 1269.7563 1285.9151 1288.8180 1297.0099 1305.5621 1339.1371 1344.7800 1345.9171 1352.8375 1360.5581 1365.3259 1386.7394 1389.9992 1393.4753 1393.7158 1411.8316 1426.9122 1447.7566 1455.9990 1458.9474 1466.8362 1467.6345 1474.9268 1475.1619 1476.0876 1476.4637 1477.2370 1478.5859 1485.8354 1487.2211 1488.8655 1489.6663 1499.8651 1585.6580 2960.0585 2963.1455 2969.6778 2971.7288 2974.2695 2976.7078 2982.0343 2985.0996 2989.6103 2992.5167 2993.2938 2995.2367 3006.1135 3011.4538 3023.3557 3035.8586 3041.8629 3045.8803 3049.6372 3058.5813 3069.3809 3069.8663 3072.2253 3074.0564 3076.7142 3089.3493 3090.9051 3102.5663 3105.2131 3111.0690
redmass: 4.0621 3.8763 3.2548 4.1662 3.1751 3.9635 3.3943 4.2538 1.8014 1.9674 1.9512 2.7068 2.5679 5.0617 2.2987 6.3220 4.9883 3.0714 3.5473 4.0165 3.9091 2.3969 2.0188 1.4484 1.4344 1.4882 2.1318 1.9053 2.0158 3.7006 4.9742 4.2342 4.5851 4.5902 2.8972 2.7141 5.8450 2.8474 8.1301 4.5248 3.7385 11.4652 4.3893 6.6146 7.5793 4.3443 1.1217 1.0840 2.1278 1.7730 1.2366 1.0903 1.0998 4.2586 3.6872 2.0325 1.7581 1.7288 1.4141 1.2304 2.4430 3.9947 2.3993 2.7018 3.3816 2.4932 2.5126 1.6895 2.2157 2.2110 2.2912 2.3825 1.4122 1.4413 1.5371 1.3485 2.1803 1.4709 1.6907 1.1545 1.1383 1.3098 1.2692 1.2399 1.1991 1.0889 1.1395 1.2927 1.3690 1.4551 1.2660 1.2583 1.4482 1.3697 1.2169 1.2149 1.2395 1.2415 2.4945 1.1029 1.1248 1.0415 1.0413 1.0620 1.0702 1.0595 1.0516 1.0567 1.0548 1.0493 1.0693 1.0714 1.0827 1.0790 1.0753 1.1079 6.8432 1.0589 1.0595 1.0637 1.0368 1.0366 1.0626 1.0559 1.0545 1.0638 1.0367 1.0628 1.0378 1.0975 1.0958 1.0611 1.0961 1.0980 1.1072 1.1083 1.1029 1.1007 1.1012 1.0994 1.0997 1.1024 1.0986 1.0981 1.1018 1.1038 1.1019
irintensity: 0.0415 0.1918 0.4702 0.1162 0.7997 0.5194 0.9902 0.8375 1.2863 0.4497 0.1076 3.6910 1.2288 1.7138 0.1094 0.4610 1.3724 0.2297 0.2403 1.4853 5.4099 6.0649 3.6736 0.1422 0.5431 2.0847 0.7135 1.7751 5.6962 2.4478 2.9260 12.0622 4.4520 6.3743 13.1721 0.4829 5.7540 8.9997 27.6834 2.3978 4.5309 108.1375 15.4481 84.8802 107.1119 8.7305 4.5090 14.1151 2.3619 1.3655 0.6048 3.3753 2.4456 186.8767 63.8845 9.2544 7.6542 14.1183 5.7631 3.8572 1.6396 1.7165 115.4392 77.7697 1.2349 0.1991 1.2577 19.2852 9.6999 9.7837 9.6352 14.1910 6.5720 4.8002 39.4355 3.9498 17.6541 36.0227 15.0779 1.8346 0.3980 4.9908 0.1945 1.0595 9.0582 1.6938 7.1696 29.3719 1.1580 1.4595 5.0725 5.3116 10.6342 8.0402 10.2824 8.7568 21.9681 23.9476 83.4597 11.9664 18.1144 9.8595 13.8422 2.6994 0.5380 6.3523 7.8490 7.3064 6.8061 11.4594 2.2741 7.5821 14.7614 16.0578 9.5515 17.5536 220.4134 28.7246 14.1877 36.6517 26.7949 42.0515 13.6445 32.9866 26.5080 62.9727 20.3043 29.3412 23.0217 19.9633 9.6318 3.9276 7.5762 14.3694 8.7355 15.3963 10.3536 45.9309 91.6943 55.9658 44.6771 65.2237 30.2060 27.0058 33.0448 0.8444 28.9711
temp: 298.150 k
press: 1.00000 atm
elementType: 16 16 15 8 8 8 7 6 6 6 6 6 6 6 6 6 6 6 6 6 6 1 1 1 1 1 1 1 1 1 1 1 1 1 1 1 1 1 1 1 1 1 1 1 1 1 1 1 1 1 1
symmnumber: 1
zpe: 1125903.9 jmol-1
zpe.correction: 0.428834 hartree
zpe.thermalcorrener: 0.458486 hartree
zpe.thermalcorrenthalpy: 0.459431 hartree
zpe.thermalcorrgfe: 0.361487 hartree
zpe.sumelectzpe: -1967.535092 hartree
zpe.sumelectthermal: -1967.505439 hartree
zpe.sumelectthermalent: -1967.504495 hartree
zpe.sumelectthermalfe: -1967.602438 hartree
dipole: -1.2011 7.0981 -1.4260
dipole: 7.3389
quadrupole: -154.6980 -166.6320 -139.9189
quadrupole: 3.3371 -4.3179 1.3593
quadrupole: -0.9483 -12.8824 13.8307 3.3371 -4.3179 1.3593
hfenergy: -1967.9639257 hartree
pointgroup: C01 [X(C14H30N1O3P1S2)]
dipole: 0.260889 2.8381081 0.4623123 debye
polarizability: 287.9272089|11.8264434|226.2172477|15.1131634|-0.1466064|203.5979725 unknown
InChI: InChI=1S/C14H30NO3PS2/c1-5-9-11-15(12-10-6-2)14(16)13-21-19(20,17-7-3)18-8-4/h5-13H2,1-4H3
charge 0 multiplicity 1
51 atoms
S  -1.356361 -2.581888 0.845697
S  -4.525767 -2.208733 -1.028027
P  -2.75574 -1.327025 -0.433598
O  1.690317 -2.382407 0.344701
O  -1.648386 -0.760688 -1.639988
O  -2.909963 0.200023 0.42962
N  1.795691 -0.058299 0.376574
C  3.092846 -0.107977 -0.34362
C  1.283717 1.279512 0.758738
C  4.307474 -0.202613 0.607845
C  0.364096 1.92074 -0.307167
C  5.648176 -0.218402 -0.160662
C  -0.191553 3.290891 0.141327
C  1.168783 -1.265115 0.652509
C  -0.165649 -1.211498 1.41162
C  6.870044 -0.304784 0.779064
C  -1.167198 3.894333 -0.892077
C  -2.205228 -0.045398 -2.831576
C  -4.002595 0.326475 1.436181
C  -1.059237 0.059651 -3.832432
C  -4.01822 1.789323 1.872197
H  3.169455 0.7999 -0.973544
H  3.077156 -0.991456 -1.005106
H  2.161689 1.931275 0.934176
H  0.752673 1.219927 1.726837
H  4.29807 0.651536 1.316485
H  4.209837 -1.126728 1.208628
H  0.931518 2.037778 -1.253229
H  -0.473681 1.23216 -0.523904
H  5.726834 0.694398 -0.787213
H  5.655889 -1.079281 -0.859064
H  0.6446 3.99687 0.324443
H  -0.718456 3.169374 1.110615
H  0.014603 -1.43816 2.477735
H  -0.71357 -0.260674 1.335766
H  6.902944 0.560273 1.468175
H  7.81757 -0.320224 0.209922
H  6.830217 -1.222753 1.394652
H  -0.671335 4.039995 -1.870357
H  -1.554468 4.875183 -0.560542
H  -2.03149 3.220978 -1.046077
H  -2.567309 0.948897 -2.506973
H  -3.054782 -0.630611 -3.232581
H  -3.789564 -0.352747 2.284809
H  -4.957412 0.022238 0.96693
H  -0.212443 0.619495 -3.400305
H  -0.704036 -0.9430 -4.122732
H  -1.404242 0.589888 -4.739648
H  -3.053179 2.078334 2.323721
H  -4.214328 2.45078 1.011091
H  -4.814507 1.946236 2.623065
