program: Gaussian 09
title: 000211554
version: EM64L-G09RevD.01
frameworkgroup: C1[X(C22H22ClN3O2)]
method: RPBEPBE
basis: SDD
operation: Freq
keyword: #p
keyword: freq=noraman
keyword: PBEPBE/SDD
title: #p freq=noraman PBEPBE/SDD
converged: YES YES NO NO
title: Mulliken charges:
elementType: Cl O O N N N C C C C C C C C C C C C C C C C C C C C C C H H H H H H H H H H H H H H H H H H H H H H
charge: -0.057313 -0.247590 -0.283541 -0.095139 -0.207463 -0.032613 -0.351067 -0.337899 -0.351679 -0.361364 -0.318715 -0.314205 0.137817 0.183390 0.017820 -0.363401 0.326593 0.459387 -0.363326 -0.389211 -0.327564 -0.364872 -0.240240 -0.244841 -0.234898 -0.234897 -0.236015 -0.224712 0.199923 0.255560 0.198289 0.204869 0.220638 0.192547 0.252768 0.236584 0.192529 0.213783 0.214237 0.193540 0.270529 0.287782 0.239882 0.261966 0.229262 0.228011 0.258396 0.236431 0.231034 0.238998
chargesum: 0.00000
title: Mulliken charges with hydrogens summed into heavy atoms:
elementType: Cl O O N N N C C C C C C C C C C C C C C C C C C C C C C
charge: -0.057313 -0.247590 -0.283541 -0.095139 -0.207463 -0.032613 0.104416 0.065260 0.061505 0.127988 0.087598 0.093572 0.137817 0.183390 0.017820 -0.092872 0.326593 0.459387 -0.075545 -0.149329 -0.327564 -0.102906 -0.010978 -0.016830 0.023498 0.001534 -0.004980 0.014286
polarizability: 3.27617609e+02 8.16049387e+00 3.90754856e+02 4.00593516e+01 1.41286637e+01 1.80139908e+02
1716.lowfreq: -7.2318 -0.0012 0.0011 0.0014 2.1375 3.4560 11.6342 20.6914 23.4893
frequency: 10.5158 20.6102 23.4791 30.0748 40.1875 56.2398 59.6134 75.3055 81.8659 108.7719 114.8631 159.6038 171.8433 181.1670 211.4310 235.7476 240.7212 250.7626 269.8955 305.4188 315.6237 323.2111 349.1273 366.4433 375.6713 393.2161 396.4746 402.1965 429.5009 440.1631 453.6297 467.6945 480.1795 516.5620 544.4592 570.7043 596.7375 614.4553 615.2042 623.0922 645.5091 654.6525 686.7205 695.3826 725.8947 746.1990 756.1554 766.0961 771.3126 786.1187 792.4911 808.6006 839.4386 841.5642 849.6235 868.8737 895.8175 911.3417 915.2882 931.9793 953.0469 977.3236 987.8936 987.9580 995.1692 998.5796 1001.8206 1018.2588 1026.2612 1027.8112 1037.7179 1042.0529 1052.4030 1076.6136 1081.4941 1090.8896 1095.0315 1109.1171 1123.3704 1133.4305 1141.2833 1173.7298 1175.8261 1189.2694 1193.2885 1203.2705 1234.4883 1243.7540 1251.0779 1265.9444 1271.2011 1288.4544 1296.5455 1314.1860 1316.0796 1324.0391 1333.6407 1338.2134 1347.2001 1360.3158 1361.8318 1367.4825 1370.6511 1385.5030 1387.3375 1416.9091 1434.4734 1436.6736 1442.6118 1447.6631 1451.2641 1458.7864 1464.5651 1469.8053 1483.6725 1488.5336 1559.1064 1567.0278 1578.1283 1598.6525 1606.2166 1610.8955 2865.7693 2871.9328 2890.0148 2954.3580 2959.1951 3031.7292 3037.2139 3051.8570 3057.8941 3080.4176 3084.0852 3123.7366 3128.9225 3132.6915 3140.4444 3146.1034 3154.8865 3162.3478 3167.9793 3176.2410 3178.0296 3188.3260
redmass: 3.3260 4.7286 7.5222 6.8968 4.1654 5.0691 5.0260 7.3530 4.1655 4.8619 4.8447 6.7104 5.1643 6.2926 3.3137 2.0513 4.6788 4.4871 4.8731 4.6782 3.5092 3.1988 5.5442 4.0507 3.7531 5.3611 2.4428 2.8466 6.7194 4.7216 3.5517 2.8215 5.3477 4.3388 4.1473 3.5875 6.7104 5.6756 2.7994 4.8933 5.6320 5.7406 6.1738 1.7683 3.4985 2.9297 3.1117 1.6755 3.2305 2.5891 1.5262 3.5313 3.6078 1.7156 1.3937 1.4013 2.5820 3.8158 1.5268 1.5662 1.3841 1.3902 1.4965 3.8894 2.5165 1.5413 2.6943 4.6761 3.0186 2.2922 2.3209 3.6075 1.9703 2.8088 2.9599 1.6435 2.5095 2.4300 1.6683 2.5628 2.5694 1.0596 1.0550 1.2473 1.6632 1.1564 2.5958 1.5178 2.5178 1.6760 1.3122 1.3810 1.3466 1.4233 1.3034 1.4576 1.3869 1.8227 1.3049 4.0479 1.5064 4.0866 1.2645 4.5348 1.4078 2.5014 1.3302 2.1906 1.0832 1.0855 1.0995 1.0990 3.7933 2.8937 1.0954 2.5046 6.1676 6.2590 5.5231 8.7733 7.2084 5.9387 1.0705 1.0695 1.0698 1.0664 1.0663 1.0885 1.0910 1.0703 1.0765 1.0963 1.0981 1.0853 1.1072 1.0886 1.0859 1.0942 1.0905 1.0997 1.0949 1.0916 1.1004 1.0952
irintensity: 0.0303 0.0926 0.1751 1.0598 0.0708 0.2997 0.7978 2.7959 0.5003 0.4123 1.1371 0.9328 1.0687 1.5401 6.9614 3.3166 3.1039 1.2409 3.8608 1.2945 2.6451 14.0360 1.6422 3.3415 2.3648 10.2815 3.1542 0.0944 11.8332 0.2251 8.3282 0.6979 3.4565 0.2639 25.8286 3.8201 17.8808 4.9481 20.4615 6.6930 6.8908 2.8653 10.1896 46.6803 0.8557 33.0601 3.6010 78.1195 2.5650 40.6628 5.4436 20.7893 19.3798 1.4669 0.5394 1.0054 8.3128 18.0373 7.7818 0.5403 2.7301 2.2769 0.6829 0.5975 12.7145 4.2022 82.8097 29.0141 11.7866 7.0406 6.8554 9.9341 17.0291 36.3696 5.0961 7.6053 58.1897 5.5433 1.4198 91.7847 62.4649 0.8170 0.0827 0.8342 13.3182 6.6836 16.0066 6.2423 14.0323 21.9521 4.5898 10.9706 4.7468 19.5758 9.4464 11.7988 11.3193 3.1838 12.0067 0.6856 2.6050 6.4657 3.7966 5.8980 2.5635 22.7245 14.0111 25.6950 2.8290 0.6255 18.3579 6.5594 7.9580 50.7160 10.6709 9.2370 206.0832 12.0902 6.5256 88.1119 12.9699 2.0708 44.9578 76.2435 102.0775 36.8336 100.2579 41.3678 26.9700 10.3004 17.6764 38.5790 39.7893 2.0259 3.1601 3.3734 1.6297 27.2983 11.0694 34.2599 6.6271 4.3929 15.9829 9.8238
temp: 298.150 k
press: 1.00000 atm
elementType: 17 8 8 7 7 7 6 6 6 6 6 6 6 6 6 6 6 6 6 6 6 6 6 6 6 6 6 6 1 1 1 1 1 1 1 1 1 1 1 1 1 1 1 1 1 1 1 1 1 1
symmnumber: 1
zpe: 1039922.9 jmol-1
zpe.correction: 0.396086 hartree
zpe.thermalcorrener: 0.420684 hartree
zpe.thermalcorrenthalpy: 0.421628 hartree
zpe.thermalcorrgfe: 0.337548 hartree
zpe.sumelectzpe: -1624.254901 hartree
zpe.sumelectthermal: -1624.230303 hartree
zpe.sumelectthermalent: -1624.229358 hartree
zpe.sumelectthermalfe: -1624.313439 hartree
dipole: 2.9139 -2.3773 -1.0431
dipole: 3.9026
quadrupole: -178.0563 -150.3309 -171.0609
quadrupole: -3.2563 6.0126 6.9842
quadrupole: -11.5736 16.1518 -4.5782 -3.2563 6.0126 6.9842
hfenergy: -1624.6509866 hartree
pointgroup: C01 [X(C22H22Cl1N3O2)]
dipole: -0.9967315 1.12482 -0.3143199 debye
polarizability: 321.5402459|17.4354091|385.5370815|-57.8814111|-10.7731247|191.4350453 unknown
InChI: InChI=1S/C22H22ClN3O2/c23-20-9-5-4-8-18(20)21-16-19(17-6-2-1-3-7-17)22(27)26(24-21)11-10-25-12-14-28-15-13-25/h1-9,16H,10-15H2
charge 0 multiplicity 1
50 atoms
Cl -2.955149 2.436777 2.26103
O  7.079268 -0.834799 -0.016228
O  0.156971 -2.513063 -0.590988
N  4.185301 -0.93207 -0.214257
N  0.488262 -0.207452 -0.702351
N  0.140705 1.112362 -0.579088
C  2.767062 -0.782342 0.168172
C  4.918109 0.357762 -0.286572
C  4.931214 -1.909416 0.619185
C  1.90323 -0.446371 -1.074508
C  6.333082 0.127416 -0.843455
C  6.34265 -2.109728 0.043238
C  -0.345487 -1.351071 -0.456265
C  -1.730935 -1.019758 -0.066817
C  -1.131767 1.377406 -0.207756
C  -2.080049 0.328139 0.026933
C  -2.717692 -2.092566 0.216424
C  -1.482139 2.824596 -0.14303
C  -2.618328 -3.384039 -0.377453
C  -3.816492 -1.832738 1.088484
C  -2.306953 3.415583 0.848733
C  -0.957292 3.6988 -1.138176
C  -3.60079 -4.365336 -0.127557
C  -4.790947 -2.818021 1.340565
C  -2.62512 4.787786 0.851328
C  -1.255689 5.074647 -1.151388
C  -4.69197 -4.08996 0.727676
C  -2.101353 5.622832 -0.159405
H  2.616658 0.009086 0.942558
H  2.404373 -1.737714 0.585991
H  4.993993 0.835659 0.722793
H  4.375243 1.056802 -0.950068
H  4.390673 -2.874064 0.610941
H  5.017761 -1.567353 1.680978
H  1.945088 -1.296327 -1.772685
H  2.256641 0.471835 -1.56785
H  6.264053 -0.249854 -1.886718
H  6.926017 1.056811 -0.821646
H  6.946997 -2.769507 0.687387
H  6.267327 -2.545416 -0.97641
H  -3.112638 0.605169 0.248588
H  -1.764813 -3.61093 -1.019588
H  -3.891058 -0.867035 1.601602
H  -0.308329 3.261257 -1.902723
H  -3.509254 -5.350207 -0.598722
H  -5.620118 -2.599953 2.022719
H  -3.261964 5.1953 1.641565
H  -0.837798 5.714959 -1.934929
H  -5.448847 -4.857441 0.924564
H  -2.348904 6.689351 -0.162119
