program: Gaussian 09
title: 000211553
version: EM64L-G09RevD.01
frameworkgroup: C1[X(C23H25N3O3)]
method: RPBEPBE
basis: SDD
operation: Freq
keyword: #p
keyword: freq=noraman
keyword: PBEPBE/SDD
title: #p freq=noraman PBEPBE/SDD
converged: YES YES NO NO
title: Mulliken charges:
elementType: O O O N N N C C C C C C C C C C C C C C C C C C C C C C C H H H H H H H H H H H H H H H H H H H H H H H H H
charge: -0.247958 -0.293160 -0.300583 -0.097471 -0.206653 -0.041838 -0.346386 -0.339659 -0.350884 -0.378776 -0.319186 -0.312687 0.127024 0.175181 0.027395 -0.344470 0.327011 0.212929 0.208394 -0.345991 -0.390333 -0.365181 -0.367928 -0.256246 -0.245485 -0.241155 -0.236010 -0.238374 -0.535070 0.227228 0.221094 0.199614 0.221533 0.211510 0.192284 0.245063 0.250475 0.191569 0.214871 0.212279 0.190824 0.277785 0.267416 0.234732 0.289576 0.239173 0.231046 0.223420 0.227938 0.228349 0.229387 0.242499 0.229784 0.224100
chargesum: 0.00000
title: Mulliken charges with hydrogens summed into heavy atoms:
elementType: O O O N N N C C C C C C C C C C C C C C C C C C C C C C C
charge: -0.247958 -0.293160 -0.300583 -0.097471 -0.206653 -0.041838 0.101936 0.081488 0.052910 0.116762 0.087254 0.090416 0.127024 0.175181 0.027395 -0.066685 0.327011 0.212929 0.208394 -0.078575 -0.155601 -0.075605 -0.128754 -0.025199 -0.022066 -0.013218 -0.007661 -0.008987 0.161313
polarizability: 3.46451459e+02 1.04913818e+01 3.98463890e+02 -4.07276943e+01 1.25384486e+01 1.77381139e+02
1716.lowfreq: -4.3643 0.0006 0.0007 0.0010 0.1195 2.9496 9.5581 15.7840 23.2734
frequency: 9.4551 15.7059 23.2611 27.9640 41.1815 58.4662 60.5622 72.0742 90.2607 97.5810 107.4448 116.6760 164.6592 177.4218 189.6821 227.0927 235.5380 239.7149 242.7947 256.5339 281.0184 293.2008 315.9236 335.0591 342.7201 349.6322 381.7546 383.5996 400.5133 403.0355 434.3270 455.5326 468.9579 471.6022 498.0657 531.6071 544.6533 548.5121 576.6799 598.9025 615.1428 615.6903 627.7595 650.8611 657.6941 695.2255 729.1494 736.8754 752.3154 758.5450 763.6672 777.9210 786.1026 795.7907 810.7864 839.4120 841.2571 849.1004 855.2454 893.3582 910.0640 913.8889 929.6532 945.8132 976.3231 980.1040 983.5249 988.1667 996.3354 997.7395 1001.5377 1026.4904 1027.8855 1040.3869 1047.5229 1053.0645 1071.3799 1078.0513 1088.9307 1093.4591 1107.7837 1111.5402 1118.2105 1136.4289 1137.7057 1155.6371 1174.6094 1177.9993 1188.0840 1193.6823 1202.1490 1215.3844 1236.6869 1243.0814 1251.5286 1271.8875 1276.3562 1288.6634 1296.6093 1310.6040 1319.8200 1326.6428 1333.7969 1337.6727 1350.1583 1360.5803 1366.7417 1371.9127 1376.9570 1386.3120 1389.9490 1420.8845 1433.0623 1436.0398 1442.8482 1443.2711 1448.6454 1452.3058 1459.9060 1463.9747 1467.9689 1472.0491 1479.3563 1484.6466 1492.9320 1556.1012 1578.0772 1585.2182 1597.9209 1608.1945 1610.6930 2868.1163 2878.3279 2906.9322 2953.7126 2958.2371 2965.3518 3028.5557 3036.7101 3047.0317 3057.0943 3058.4824 3079.7304 3083.6274 3122.4277 3123.3861 3132.7246 3133.2236 3134.9324 3145.1172 3152.4761 3161.2185 3167.3429 3176.1706 3187.5388 3195.3777
redmass: 5.8887 4.4325 2.8799 5.8083 3.8505 4.2274 5.0545 6.2056 4.2638 3.2826 5.0862 4.5293 5.0823 3.5958 3.6890 3.5255 3.4782 2.2867 2.0642 2.4344 3.0574 3.3206 2.6402 4.5919 4.4400 3.5568 3.6913 5.4091 2.0801 2.8390 5.7169 4.5878 2.8054 3.6477 5.2812 3.9574 4.3322 5.0462 3.4010 7.0894 4.9301 3.1739 4.6518 5.3079 5.0268 1.7429 4.7115 3.7801 3.2256 1.4789 2.2627 3.4087 2.7274 2.4458 2.7662 2.7632 1.9770 1.3952 1.4937 2.5194 4.3202 1.5405 1.5498 1.3776 1.3871 1.3546 7.7943 5.0423 1.7001 2.1631 2.3634 2.8109 2.3489 3.3583 2.6098 2.0133 2.9475 2.9767 1.6381 2.7164 2.4752 1.2732 1.9714 2.2731 2.6093 1.4044 1.0548 1.0916 1.5247 1.3779 1.1708 3.0639 2.4482 1.5681 2.8111 1.2874 1.6957 1.4268 1.3029 1.2762 1.4834 1.3912 1.3444 1.8316 1.3270 3.2367 1.4281 1.2922 6.2385 4.6579 1.4205 2.1742 1.2429 2.2056 1.3866 1.0832 1.0822 1.1014 1.0984 3.2057 1.0678 1.2315 1.1006 2.1637 2.2684 6.0262 5.5156 7.1268 8.1025 6.6083 5.9301 1.0701 1.0700 1.0685 1.0664 1.0665 1.0323 1.0905 1.0912 1.0894 1.1043 1.0580 1.0963 1.0977 1.0848 1.1000 1.0884 1.1067 1.0859 1.0944 1.0904 1.0997 1.0935 1.0992 1.0952 1.0916
irintensity: 0.0932 0.1081 0.1206 0.3770 0.0968 2.0364 0.2991 0.1621 1.9612 4.7657 1.1321 3.1188 1.4957 2.3152 0.2370 9.1357 2.4943 0.6479 0.7405 1.1364 0.9405 0.8619 9.1678 4.1849 0.4131 10.2182 7.9523 1.6187 0.9974 0.1705 3.5779 11.8258 1.1941 3.5947 4.2573 5.1885 22.5260 8.4012 3.6781 19.5062 4.9066 20.6717 5.9519 3.1673 2.9574 47.7174 8.8054 4.0679 14.2182 78.6799 13.7707 16.4430 34.6251 9.8772 16.2217 14.3208 9.9015 0.6357 1.4558 5.7878 16.4481 17.9466 0.7223 3.5185 2.3577 1.2768 60.9864 0.0723 30.6069 32.5674 17.2555 11.4993 8.6887 8.5597 32.6330 12.8192 11.5705 25.5553 11.9855 18.4280 9.7511 0.2834 19.9459 34.2584 100.7237 0.9127 0.0354 9.0330 12.6589 14.7488 3.3477 104.6959 2.7142 19.7745 11.2456 5.7601 46.7165 26.6154 2.4262 17.1117 1.5662 11.5284 4.9523 11.6516 5.8746 7.9441 5.2162 6.2803 14.0925 2.6694 4.2084 22.7549 13.7516 32.1580 13.2049 2.8712 0.2105 15.5662 9.0946 7.5984 13.9365 60.6959 11.9964 50.5402 7.5861 252.7181 6.5205 40.3482 56.2289 27.0894 0.2023 61.0995 73.8564 66.5769 35.0599 108.1405 69.5159 25.7130 26.4878 29.8852 38.8110 20.9350 41.9367 36.1497 2.0201 19.0710 4.8890 3.1940 1.2627 32.6432 15.4048 34.5316 15.4182 21.4489 10.1988 5.6680
temp: 298.150 k
press: 1.00000 atm
elementType: 8 8 8 7 7 7 6 6 6 6 6 6 6 6 6 6 6 6 6 6 6 6 6 6 6 6 6 6 6 1 1 1 1 1 1 1 1 1 1 1 1 1 1 1 1 1 1 1 1 1 1 1 1 1
symmnumber: 1
zpe: 1148263.7 jmol-1
zpe.correction: 0.437351 hartree
zpe.thermalcorrener: 0.463315 hartree
zpe.thermalcorrenthalpy: 0.464260 hartree
zpe.thermalcorrgfe: 0.377310 hartree
zpe.sumelectzpe: -1279.218770 hartree
zpe.sumelectthermal: -1279.192805 hartree
zpe.sumelectthermalent: -1279.191861 hartree
zpe.sumelectthermalfe: -1279.278811 hartree
dipole: -5.8513 -2.3265 1.2837
dipole: 6.4264
quadrupole: -163.3326 -156.5498 -167.6304
quadrupole: 0.2083 -16.1877 -1.6841
quadrupole: -0.8283 5.9544 -5.1261 0.2083 -16.1877 -1.6841
hfenergy: -1279.6561207 hartree
pointgroup: C01 [X(C23H25N3O3)]
dipole: -2.1031674 1.1619234 -0.7867857 debye
polarizability: 326.9584263|-11.8824075|397.8458251|65.9901254|21.681029|197.4922365 unknown
InChI: InChI=1S/C23H25N3O3/c1-28-22-10-6-5-9-19(22)21-17-20(18-7-3-2-4-8-18)23(27)26(24-21)12-11-25-13-15-29-16-14-25/h2-10,17H,11-16H2,1H3
charge 0 multiplicity 1
54 atoms
O  7.375074 -0.148135 0.442668
O  1.130788 -2.200663 0.614677
O  -3.428499 1.641636 -1.633889
N  4.52165 0.389843 0.466531
N  0.753063 0.096134 0.764479
N  0.038289 1.257978 0.64016
C  3.116435 0.404363 0.006239
C  5.048337 -0.986512 0.672796
C  5.442696 1.163982 -0.404962
C  2.153789 0.277049 1.212819
C  6.451619 -0.918775 1.294835
C  6.841328 1.207963 0.233433
C  0.314427 -1.233774 0.454961
C  -1.077541 -1.310202 -0.028477
C  -1.238394 1.154151 0.199944
C  -1.806591 -0.124268 -0.124202
C  -1.679199 -2.615701 -0.407134
C  -1.992857 2.438162 0.146208
C  -3.081677 2.682356 -0.750818
C  -1.608773 3.494325 1.014851
C  -2.757627 -2.658542 -1.339945
C  -1.22503 -3.845495 0.151339
C  -3.751678 3.930431 -0.750564
C  -2.267741 4.739624 1.016071
C  -3.372847 -3.8777 -1.685475
C  -1.848464 -5.063957 -0.192457
C  -3.346992 4.954844 0.131523
C  -2.924857 -5.089704 -1.107902
C  -4.461713 1.905194 -2.639811
H  2.90334 -0.41608 -0.718826
H  2.915188 1.364143 -0.504694
H  5.100815 -1.543592 -0.295904
H  4.371515 -1.54862 1.341554
H  5.056006 2.194925 -0.513715
H  5.523728 0.713358 -1.426119
H  2.192225 1.188604 1.826761
H  2.425188 -0.600971 1.818662
H  6.390562 -0.448794 2.300171
H  6.899343 -1.922739 1.37921
H  7.56629 1.711564 -0.427507
H  6.785392 1.742772 1.206448
H  -2.850382 -0.146737 -0.437626
H  -0.770094 3.308672 1.692098
H  -3.095393 -1.734844 -1.823477
H  -0.376919 -3.834932 0.839024
H  -4.585083 4.11183 -1.434857
H  -1.947874 5.528842 1.703798
H  -4.192737 -3.886358 -2.412542
H  -1.486566 -5.997251 0.253185
H  -3.876879 5.91368 0.124233
H  -3.401228 -6.039121 -1.376974
H  -4.517603 0.983963 -3.238514
H  -4.179607 2.75525 -3.289744
H  -5.443546 2.103428 -2.168545
